{"text_format":"1","workbook":"xlsx","n_sheets":20,"sheets":["Instructions","Project Info","Inventory","Summary","Report","Inspection Form","Building Types","Unitary","VRF","Chiller","PTAC","RoomAC","SPVAC","Geothermal","CRAC","Equipment Lookups","County to Zone","EFLH","Utility Admin","Version Log"],"not_rendered":{"charts":3,"images":18,"macros":1,"external_links":0,"defined_names":227,"comments":0,"pivot_tables":0},"unopened":[],"bounds":{"document_bytes":16777216,"sheet_cells":100000,"rows_first":2000,"rows_last":500,"rows_between":2000,"halvings":0,"cell_chars":16384,"cell_head_chars":4096},"cells_cut":0,"cells_raw":0,"read":"whole","date_system":"1900"}

{"sheet":"Instructions","index":0,"n_rows":75,"n_cols":4,"rows_kept":75,"cut":false,"hidden":true,"merged":[[74,1,75,16],[61,3,62,16],[2,0,3,12],[26,1,28,12],[37,1,38,16],[56,2,57,16],[58,2,59,16],[69,1,70,16],[72,1,73,16]]}
[1]
["Instructions"]
["This sheet provides basic instructions for using this calculator. Please contact the utility rebate program staff for further help or questions."]
[]
[]
["Getting Started"]
[]
[null,"After opening the file, enable macros if prompted. This tool uses macros to format the spreadsheets for different scenarios."]
[]
[]
[]
[]
[]
[]
[]
[]
[]
[]
[]
[]
[]
[]
[]
[]
["Project Info"]
[]
["-","Start with this sheet. Enter in all relevant information for the project. The minimum required fields are State, Utility, County, and Program; these fields have drop-downs. Once these have been filled in, macros will automatically un-hide the next sheets."]
[]
[]
[]
[]
["-","The \"Reset Workbook\" button clears all user-input cells and reverts the calculator back to a \"fresh\" file."]
[]
["Inventory"]
[]
["Tips: "]
["-","Move from left to right across the Inventory columns, as several drop-downs depend on the values in prior columns."]
["-","Do not enter values in grayed-out cells. Conditional formatting will gray out unneeded cells as you go, and values left in these cells will cause errors in the calculation. If a cell becomes grayed out and it is not empty, please clear it out."]
[]
[]
["1.","Select the Project Type:"]
[null,"a.","Early Retirement - the replacement of fully-functioning equipment"]
[null,"b.","New Construction - installation of equipment where there was not previously equipment"]
[null,"c.","Replace on Burnout - the replacement of broken or not fully-functioning equipment"]
["2.","Select the Building Type. See the \"Building Types\" tab for descriptions of each building type."]
["3.","(Early Retirement Only) - Input existing equipment information, including equipment type, cooling capacity, year of manufacture, and quantity of units."]
[null,"a.","Cooling capacity may be entered in Btu/hr or tons. Default units will populate but may be changed via drop-down. Ensure that the correct units are selected in column G. 1 Ton = 12,000 Btu/hr"]
[null,"b.","Heating section type: If applicable to your system, it will change from gray to white. For heat pump systems, this refers to the auxiliary/emergency heating type."]
[null,"c.","Quantity: the number of units in the project scope with these characteristics."]
[null,"d.","Manufacture year: choose the year the existing equipment was made. If unknown, select \"Unknown\". If older than the oldest year, select the oldest year."]
[]
["4.","Enter the new equipment information. Some of these columns are specific to certain types of equipment and will not appear until that equipment has been selected."]
[null,"a.","Cooling and heating capacities may be entered in Btu/hr or tons. Default units will populate but may be changed via drop-down. Ensure that the correct units are selected in columns R and T. 1 Ton = 12,000 Btu/hr"]
[null,"b.","Heating section type: If applicable to your system, it will change from gray to white. For heat pump systems, this refers to the auxiliary/emergency heating type."]
[null,null,"-","Elec Res or None: for systems with no heating or electric resistance heating"]
[null,null,"-","Other: for systems with an alternative heating source (i.e., natural gas)"]
[null,"c.","Chiller baseline path: For chilled water systems, choose either Path A (favoring full-load efficiency) or Path B (favoring part-load efficiency) compliance. If the chiller qualifies for both paths, choose the option which begets the best incentive. The workbook defaults to path A."]
[]
[null,"d.","Redundant Chiller Systems: If the facility has redundant chillers (n+1) and they are sequenced such that, instead of allowing one chiller to operate at full load during peak cooling, the redundant chillers share the peak load while individually operating at partial loads, select \"Yes\". Otherwise, select \"No\"."]
[]
[null,"e.","Enter the full and part load efficiency values for the new equipment. The default efficiency units will auto-populate, but may be changed via drop-down."]
[null,null,"-","Efficiencies should be at AHRI standard conditions. For DX systems, these can usually be found on AHRI certificates. For chilled water systems, these should be the IPLV at AHRI 550/590 conditions."]
[]
[null,null,"-","\"EER\" includes values in EER, SEER, IEER, CEER, or BTU/W."]
[null,null,"-","\"SCOP\" is Seasonal Coefficient of Performance (typically only CRAC units)."]
[null,"f.","For heat pumps, enter the high-heating (47F) efficiency and unit format."]
[null,"g.","Enter the quantity of units to be installed."]
[]
["Notes:"]
["-","Once the Installed Equipment type, capacity, and efficiency format have been filled out, columns AQ-AU will show the program minimum efficiency values in the chosen units."]
[]
[]
["-","For Early Retirement projects, the installed (capacity x quantity) cannot exceed 120% of the removed (capacity x equipment). A message will appear if this happens, contact program staff if you encounter this situation."]
[]
["-","The only equipment type change this workbook supports is air cooled chiller to water cooled chiller. For other equipment type changes, please contact program staff for assistance."]

{"sheet":"Project Info","index":1,"n_rows":19,"n_cols":17,"rows_kept":19,"cut":false,"hidden":false,"merged":[[13,3,13,8],[15,3,15,4],[16,3,16,4],[18,3,18,10],[12,3,12,10],[1,3,1,10],[2,3,2,10],[3,3,3,10],[4,3,4,10],[7,3,7,4],[6,3,6,4],[6,8,6,9],[7,8,7,9],[8,3,8,4],[9,3,9,10],[10,3,10,4],[10,8,10,10],[11,3,11,5],[11,9,11,10]]}
[1,null,null,{"$f":"IF(OR(D7=\"\",D8=\"\",I7=\"\",I8=\"\"),\"Please fill in highlighted cells to continue.\",\"\")","v":"Please fill in highlighted cells to continue."},null,null,null,null,null,null,"v21.0"]
[null,null,"Assessed by:"]
[null,null,"Project ID:"]
[null,null,"Project Name:"]
[null,null,"Project Sponsor:"]
[]
[null,null,"State:",null,null,null,null,"Utility:"]
[null,null,{"$f":"IFERROR(IF('Project Info'!D7=\"LA\",\"Parish:\",\"County:\"),\"\")","v":"County:"},null,null,null,null,"Program:"]
[null,null,"Climate Zone:",{"$f":"IFERROR(State&\" Zone \"&SelectedZone,\"-\")","v":"-"}]
[null,null,"Contact Name:"]
[null,null,"Contact Phone:",null,null,null,null,"Contact Email:"]
[null,null,"Account Number:",null,null,null,null,null,"Name on Account:"]
[null,null,"Project Site Address:"]
[null,null,"City:",null,null,null,null,null,null,"ZIP Code:"]
[]
[null,null,"Incentive Paid to:",null,null,null,null,null,"$/kWh","$/kW"]
[null,null,"Project Cost:",null,null,null,null,"Utility Rates:",0.1,0,null,null,null,null,"Incentive Override:",null,"$/kWh"]
[]
[null,null,"Project Decription:"]

{"sheet":"Inventory","index":2,"n_rows":34,"n_cols":133,"rows_kept":34,"cut":false,"hidden":true,"merged":[[4,44,6,44],[5,37,6,37],[5,38,6,38],[4,35,4,38],[5,32,5,33],[5,34,6,34],[4,32,4,34],[5,35,6,35],[5,36,6,36],[5,3,6,3],[5,29,5,30],[5,10,6,10],[5,12,6,12],[5,13,6,13],[5,26,5,28],[4,46,4,50],[4,1,6,1],[5,46,6,46],[4,2,6,2],[5,5,6,5],[5,8,6,8],[5,9,6,9],[5,11,6,11],[5,14,6,14],[5,15,6,15],[5,16,5,17],[5,6,5,7],[5,18,5,19],[5,21,6,21],[5,20,6,20],[4,42,6,42],[4,72,5,74],[4,52,4,54],[5,4,6,4],[5,49,6,49],[5,31,6,31],[4,40,6,40],[4,41,6,41],[4,39,6,39],[4,43,6,43],[5,22,6,22],[5,23,6,23],[5,24,6,24],[5,25,6,25],[5,47,6,47],[5,48,6,48],[5,50,6,50]]}
[1,null,null,null,null,null,null,null,null,null,null,null,null,null,null,null,null,null,null,null,null,null,null,null,null,null,null,null,null,null,null,null,null,null,null,null,null,null,null,null,null,null,{"$f":"'Project Info'!K1","v":"v21.0"}]
["Commercial HVAC Calculator",null,null,null,null,null,null,null,null,null,null,null,"For calculator to work correctly, please make sure all grey-background input cells are blank.",null,null,null,null,null,null,null,null,null,null,null,null,null,null,null,null,null,null,null,null,null,null,null,null,null,null,{"$f":"AN5","v":"NCP kW"},{"$f":"AO5","v":"Peak kW"},"kWh","Incentive","Non-Capped Incentive","Total Cost"]
[null,"Project Name:",{"$f":"IF('Project Info'!D4=\"\",\"\",'Project Info'!D4)","v":""},null,null,null,null,null,null,null,null,null,null,null,null,null,null,null,null,null,null,null,null,null,null,null,null,null,null,null,null,null,null,null,null,null,null,null,null,{"$f":"SUM(AN8:AN32)","v":0},{"$f":"SUM(AO8:AO32)","v":0},{"$f":"SUM(AP8:AP32)","v":0},{"$f":"SUM(AQ8:AQ32)","v":0},{"$f":"SUM(AR8:AR32)","v":0},{"$f":"ProjectCost","v":0},{"$f":"IFERROR(IF(AQ3='Utility Admin'!I2,\"Incentive is capped\",\"\"),\"\")","v":""},null,null,null,null,null,null,null,null,null,null,null,null,null,null,null,null,null,null,null,null,null,null,null,null,null,null,null,null,null,null,null,null,null,null,null,null,null,null,null,null,null,null,null,null,null,null,null,null,null,null,null,null,null,null,null,null,null,null,null,null,null,null,"Program Year for ER calcs:",2021]
[null,null,null,null,null,{"$f":"IF(COUNTIF(BE8:BE32,\"CAP\")>0,\"Greater than 20% decrease in capacity. A capped Removed Equipment tonnage will be used.\",\"\")","v":""},null,null,null,null,null,null,null,null,null,{"$f":"IF(BC6>0,\"The change in equipment type is not supported by this calculator. Please contact program engineering for further assistance.\",\"\")","v":""}]
[null,"Project Type","Building Type","Removed Equipment",null,null,null,null,null,null,null,null,"Installed Equipment",null,null,null,null,null,null,null,null,null,null,null,null,null,null,null,null,null,null,null,"Baseline Efficiency Overrides",null,null,"Weather Factor Overrides",null,null,null,"NCP kW","Peak kW","kWh","Incentive","Non-Capped Incentive","Estimated Cost",null,"Minimum Efficiency Required",null,null,null,null,null,"macro triggers",null,null,null,null,null,null,null,null,null,null,null,null,null,null,null,null,null,null,null,"Weather Factors",null,null,{"$f":"CONCATENATE('Project Info'!D7,\"_EFLHZone\",EFLH!$C$1)","v":{"$error":"#REF!"}}]
[null,null,null,"Manufacturer / Model #","Serial #(s)","Equipment Type","Cooling Capacity",null,"Equipment Detail","Heating Section Type","# of Units","Manuf Year","Manufacturer / Model #","Serial #(s)","AHRI Reference #","Equipment Type","Cooling Capacity",null,"Heating Capacity",null,"Equipment Detail","Heating Section Type","Chiller Baseline Path","Part of Redundant Chiller System?","HP of Condenser Water Pump","HP of Cooling Tower Fan","Cooling Efficiency",null,null,"High-Heating Efficiency",null,"# of Units","Cooling Efficiency (kW/ton only)",null,"Heating Efficiency (COP only)","EFLH,c","EFLH,h","Summer Peak CF","NCF",null,null,null,null,null,null,null,"Full-Load","Part-Load","Format","Heating","Format",null,{"$f":"MAX(BA8:BA32)","v":0},{"$f":"MAX(BB8:BB32)","v":0},{"$f":"MAX(BC8:BC32)","v":0},null,null,null,null,null,null,null,null,null,null,null,null,null,null,null,null,null,null,null,null,null,null,"Efficiencies (kW/ton)",null,null,null,null,null,null,null,null,null,null,null,"Savings",null,null,null,null,null,null,null,null,null,null,null,"Savings",null,null,null,"Incentives",null,null,"Early retirement calculations"]
[null,null,null,null,null,null,"Rating","Units",null,null,null,null,null,null,null,null,"Rating","Units","Rating","Units",null,null,null,null,null,null,"Full-Load","Part-Load","Format","Rating","Format",null,"Full-Load","Part-Load",null,null,null,null,null,null,null,null,null,null,null,null,null,null,null,null,null,null,"Heat Pump?","Chiller?","Eqpmt Chg?","All Eligible?","ER delta cap","ER ACC to WCC adj","Eq Type List","Pre Tons","Pre kbtuh","Pre capacity range","Year to Use","Pre lookup without capacity","Pre lookup with capacity","Tons to Use","kbtuh to use","Heating tons","capacity range","Lookup without capacity","Lookup with capacity","New Eq type","Summer Peak CF","EFLH Cooling","EFLH Heating","NCP factor","Chiller Adj Factor","Pre ER Full","Pre ER Part","Pre ER Heat","Pre ROB Full","Pre ROB Part","Pre ROB Heat","Pre NC Full","Pre NC Part","Pre NC  Heat","New Full","New Part","New Heat","ER kW s","ER kW NCP","ER kWh c","ER kWh h","ROB kW s","ROB kW NCP","ROB kWh c","ROB kWh h","NC kW s","NC kW NCP","NC kWh c","NC kWh h","Summer Demand Savings (kW)","NCP Savings","Cooling Energy Savings (kWh)","Heating Energy Savings (kWh)","$/NCP","$/kW","$/kWh","Equipment Age (yrs)","RUL","EUL (yrs)","YearsST","NPV kW s FT","NPV kW s ST","NPV NCP kW FT","NPV NCP kW ST","NPV kWh c FT","NPV kWh c ST","NPV kWh h FT","NPV kWh h ST","NPV kW s Total","NPV kw NCP Total","NPV kWh c Total","NPV kWh h total","NPV kWEUL","NPV kWhEUL","kW s","kW NCP","kWh c","kWh h","Current kWh","Current kW","New kWh"]
[1,null,null,null,null,null,null,{"$f":"IFERROR(INDEX(DefaultUnits,MATCH(F8,EquipmentTypes,0),1),\"\")","v":""},null,null,null,null,null,null,null,null,null,{"$f":"IFERROR(INDEX(DefaultUnits,MATCH(P8,EquipmentTypes,0),1),\"\")","v":""},null,{"$f":"IF(IFERROR(SEARCH(\"Heat\",P8,1)>0,FALSE),R8,\"\")","v":""},null,null,{"$f":"IF(IFERROR(SEARCH(\"chiller\",P8)>0,FALSE),\"A\",\"\")","v":""},{"$f":"IF(IFERROR(SEARCH(\"chiller\",P8)>0,FALSE),\"No\",\"\")","v":""},null,null,null,null,{"$f":"IFERROR(INDEX(DefaultUnits,MATCH(P8,EquipmentTypes,0),3),\"\")","v":""},null,{"$f":"IFERROR(IF(BA8=0,\"\",IF(S8*IF(T8=\"tons\",12000,1)<=65000,\"HSPF\",\"COP\")),\"\")","v":""},null,null,null,null,null,null,null,null,{"$f":"IF(BD8=\"NO\",\"Check Min Eff\",IF(BE8=\"NO\",\"Check Change in Capacity\",IF(BC8=1,0,IFERROR(ROUND(CY8,3),\"\"))))","v":0},{"$f":"IF(BD8=\"NO\",\"Check Min Eff\",IF(BE8=\"NO\",\"Check Change in Capacity\",IF(BC8=1,0,IFERROR(ROUND(CX8,3),\"\"))))","v":0},{"$f":"IF(BD8=\"NO\",\"Check Min Eff\",IF(BE8=\"NO\",\"Check Change in Capacity\",IF(BC8=1,0,ROUND((CZ8+DA8),0))))","v":0},{"$f":"IFERROR(IF($AR$3<'Utility Admin'!$I$2,AR8,'Utility Admin'!$I$2/Inventory!$AR$3*AR8),0)","v":0},{"$f":"IFERROR(AN8*DB8+AO8*DC8+AP8*DD8,0)","v":0},{"$f":"IFERROR(ProjectCost-SUM(AS9:AS32),0)","v":0},null,{"$f":"IFERROR(IF(OR(AC8=\"\",Q8=\"\"),\"\",IF(AC8=\"EER\",12/CF8,IF(AC8=\"SCOP\",3.517/CF8,CF8))),\"\")","v":""},{"$f":"IFERROR(IF(OR(Q8=\"\",AC8=\"\"),\"\",IF(AC8=\"EER\",12/CG8,IF(AC8=\"SCOP\",3.517/CG8,CG8))),\"\")","v":""},{"$f":"AC8","v":""},{"$f":"IF(S8=\"\",\"\",IFERROR(IF(IFERROR(SEARCH(\"Heat\",P8,1)>0,FALSE),IF(AE8=\"HSPF\",12/CH8,IF(AE8=\"COP\",12/3.412/CH8,\"\")),\"\"),\"\"))","v":""},{"$f":"AE8","v":""},null,{"$f":"IF(IFERROR(SEARCH(\"Heat Pump\",P8)>0,FALSE),IF(IFERROR(SEARCH(\"Room\",P8)>0,FALSE),0,1),0)","v":0},{"$f":"IF(OR(P8=\"Water Cooled Chiller\",P8=\"Air Cooled Chiller\"),IF(AND($B8=\"Early Retirement\",$F8=\"Air Cooled Chiller\",$P8=\"Water Cooled Chiller\"),3,IF(TRM=\"CPS\",2,IF(TRM=\"ARTRM8\",1,0))),0)","v":0},{"$f":"IF(AND(B8=\"Early Retirement\",F8<>\"\",P8<>\"\",F8<>P8,NOT(AND(F8=\"Air Cooled Chiller\",P8=\"Water Cooled Chiller\"))),1,0)","v":0},{"$f":"IFERROR(IF(OR(AC8=\"\",IF(IFERROR(SEARCH(\"Heat\",P8,1)>0,FALSE),AE8=\"\",FALSE)),\"UNITS\",IF(AND(CJ8<=CG8,CI8<=CF8,IF(IFERROR(SEARCH(\"Heat\",P8,1)>0,FALSE),CK8<=CH8,TRUE)),\"YES\",\"NO\")),\"---\")","v":"UNITS"},{"$f":"IF(OR(G8=\"\",K8=\"\",Q8=\"\",AF8=\"\"),\"\",IF(AND(B8=\"Early Retirement\",BH8*K8*1.2<BN8*AF8),\"NO\",IF(AND(B8=\"Early Retirement\",BH8*K8*0.8>BN8*AF8),\"CAP\",\"YES\")))","v":""},{"$f":"(Y8*AF8+Z8)*0.746*0.8/0.86","v":0},{"$f":"IF('Project Info'!$D$7=\"TX\",INDEX(EFLH!$AB$4:$AB$30,MATCH(C8,TX_EFLHSanAntonio[Building Type],0),1),'Project Info'!$D$7&\"EquipmentType\")","v":"EquipmentType"},{"$f":"IF(H8=\"tons\",G8,IF(H8=\"Btuh\",G8/12000,0))","v":0},{"$f":"IF(BE8=\"CAP\",BO8*1.2,BH8*12000)","v":0},{"$f":"IF(IFERROR(SEARCH(\"Terminal\",F8,1)>0,FALSE),\"\",HLOOKUP(BI8,'Equipment Lookups'!$L$4:$AB$46,VLOOKUP(Inventory!BL8,'Equipment Lookups'!$J$5:$K$46,2,FALSE),TRUE))","v":{"$error":"#N/A"}},{"$f":"IF(L8=\"Unknown\",YEAR(TODAY())-INDEX('Equipment Lookups'!$AC$5:$AC$38,MATCH(Inventory!BL8,'Equipment Lookups'!$J$5:$J$38,0)),L8)","v":0},{"$f":"SUBSTITUTE(SUBSTITUTE(CONCATENATE(F8, I8), \" \", \"\"),\"/\",\"\")","v":""},{"$f":"SUBSTITUTE(SUBSTITUTE(CONCATENATE(F8,I8,J8,IF(BB8>0,IF(W8=\"\",\"A\",W8),\"\"),BJ8),\" \",\"\"),\"/\",\"\")","v":{"$error":"#N/A"}},{"$f":"IF(R8=\"tons\",Q8,IF(R8=\"Btuh\",Q8/12000,0))","v":0},{"$f":"BN8*12000","v":0},{"$f":"IF(T8=\"tons\",S8,IF(T8=\"Btuh\",S8/12000,0))","v":0},{"$f":"IF(IFERROR(SEARCH(\"Terminal\",P8,1)>0,FALSE),\"\",HLOOKUP(BO8,'Equipment Lookups'!$L$4:$AB$46,VLOOKUP(Inventory!BR8,'Equipment Lookups'!$J$5:$K$46,2,FALSE),TRUE))","v":{"$error":"#N/A"}},{"$f":"SUBSTITUTE(SUBSTITUTE(CONCATENATE(P8, U8), \" \", \"\"),\"/\",\"\")","v":""},{"$f":"SUBSTITUTE(SUBSTITUTE(CONCATENATE(P8, U8,V8,IF(BB8>0,IF(W8=\"\",\"A\",W8),\"\"),BQ8), \" \", \"\"),\"/\",\"\")","v":{"$error":"#N/A"}},{"$f":"INDEX('Equipment Lookups'!$AD$5:$AD$46,MATCH(Inventory!BR8,'Equipment Lookups'!$J$5:$J$46,0))","v":{"$error":"#N/A"}},{"$f":"IFERROR(IF(AL8<>\"\",AL8,IF(State=\"TX\",INDEX(TX_EFLHSanAntonio[[CFAir Cooled Chiller]:[CFPTRoom]],MATCH(Inventory!C8,TX_EFLHSanAntonio[Building Type],0),MATCH(BT8,EFLH!$N$2:$Q$2,0)),VLOOKUP(C8,INDIRECT($BX$5),4,FALSE))),\"-\")","v":"-"},{"$f":"IFERROR(IF(AJ8<>\"\",AJ8,IF(State=\"TX\",INDEX(TX_EFLHSanAntonio[[EFLHcAir Cooled Chiller]:[EFLHcPTRoom]],MATCH(Inventory!C8,TX_EFLHSanAntonio[Building Type],0),MATCH(BT8,EFLH!$V$2:$Y$2,0)),VLOOKUP(C8,INDIRECT($BX$5),2,FALSE))),\"-\")","v":"-"},{"$f":"IFERROR(IF(AK8<>\"\",AK8,IF(State=\"TX\",INDEX(TX_EFLHSanAntonio[[EFLHhDX]:[EFLHhPTRoom]],MATCH(Inventory!C8,TX_EFLHSanAntonio[Building Type],0),MATCH(BT8,EFLH!$Z$2:$AA$2,0)),VLOOKUP(C8,INDIRECT($BX$5),3,FALSE))),\"-\")","v":"-"},{"$f":"IF(AM8<>\"\",AM8,IF(State=\"TX\",INDEX(TX_EFLHSanAntonio[[NCPAir Cooled Chiller]:[NCPPTRoom]],MATCH(Inventory!C8,TX_EFLHSanAntonio[Building Type],0),MATCH(BT8,EFLH!$R$2:$U$2,0)),0))","v":0},{"$f":"IF(X8=\"Yes\",0.58,1)","v":1},{"$f":"IF(IFERROR(SEARCH(\"Terminal\",F8,1)>0,FALSE),INDEX(INDIRECT(BM8),A8,1),INDEX(INDIRECT(BM8),MATCH(IF(BK8<1990,1990,BK8),BaselineRow,0),1))","v":{"$error":"#N/A"}},{"$f":"IF(IFERROR(SEARCH(\"Terminal\",F8,1)>0,FALSE),INDEX(INDIRECT(BM8),A8,1),INDEX(INDIRECT(BM8),MATCH(IF(BK8<1990,1990,BK8),BaselineRow,0),2))","v":{"$error":"#N/A"}},{"$f":"IF(IFERROR(SEARCH(\"Heat\",F8,1)>0,FALSE),IF(IFERROR(SEARCH(\"Terminal\",F8,1)>0,FALSE),INDEX(INDIRECT(BM8),A8,5),INDEX(INDIRECT(BM8),MATCH(IF(BK8<1990,1990,BK8),BaselineRow,0),IF(IFERROR(SEARCH(\"Unitary\",F8,1)>0,FALSE),3,3))),\"\")","v":""},{"$f":"IF(AG8<>\"\",AG8,IF(IFERROR(SEARCH(\"Terminal\",P8,1)>0,FALSE),INDEX(INDIRECT(BS8),A8,MATCH(TRM,PTAC!$AC$9:$AE$9,0)),INDEX(INDIRECT(BS8),MATCH(TRM,BaselineRow,0),1)))","v":{"$error":"#N/A"}},{"$f":"_xlfn.SINGLE(IF(AH8<>\"\",AH8,IF(IFERROR(SEARCH(\"Terminal\",P8,1)>0,FALSE),CC8,INDEX(INDIRECT(BS8),MATCH(TRM,BaselineRow,0),2))))","v":{"$error":"#N/A"}},{"$f":"IF(AI8<>\"\",12/3.412/AI8,IF(IFERROR(SEARCH(\"Heat\",P8,1)>0,FALSE),IF(IFERROR(SEARCH(\"Terminal\",P8,1)>0,FALSE),INDEX(INDIRECT(BS8),A8,3+MATCH(TRM,PTAC!$AC$9:$AE$9,0)),INDEX(INDIRECT(BS8),MATCH(TRM,BaselineRow,0),3)),\"\"))","v":""},{"$f":"IF(AG8<>\"\",AG8,IF(IFERROR(SEARCH(\"Terminal\",P8,1)>0,FALSE),INDEX(INDIRECT(BS8),A8,MATCH(TRM,PTAC!$AC$9:$AE$9,0)),INDEX(INDIRECT(BS8),MATCH(TRM,BaselineRow,0),1)))","v":{"$error":"#N/A"}},{"$f":"_xlfn.SINGLE(IF(AH8<>\"\",AH8,IF(IFERROR(SEARCH(\"Terminal\",P8,1)>0,FALSE),CF8,INDEX(INDIRECT(BS8),MATCH(TRM,BaselineRow,0),2))))","v":{"$error":"#N/A"}},{"$f":"IF(AI8<>\"\",12/3.412/AI8,IF(IFERROR(SEARCH(\"Heat\",P8,1)>0,FALSE),IF(IFERROR(SEARCH(\"Terminal\",P8,1)>0,FALSE),INDEX(INDIRECT(BS8),A8,3+MATCH(TRM,PTAC!$AC$9:$AE$9,0)),INDEX(INDIRECT(BS8),MATCH(TRM,BaselineRow,0),3)),\"\"))","v":""},{"$f":"IFERROR(IF(AC8=\"kW/ton\",AA8,IF(AC8=\"SCOP\",3.517,12)/AA8),\"\")","v":""},{"$f":"IFERROR(IF(IFERROR(SEARCH(\"Terminal\",P8,1)>0,FALSE),12/AA8,IF(IFERROR(SEARCH(\"Room\",P8,1)>0,FALSE),IF(AC8=\"SCOP\",3.517,12)/AA8,IF(AB8=\"\",\"\",IF(AC8=\"EER\",12/AB8,AB8)))),\"\")","v":""},{"$f":"IFERROR(IF(IFERROR(SEARCH(\"Room\",P8,1)>0,FALSE),12/AA8,IF(AE8=\"HSPF\",12/AD8,IF(AE8=\"COP\",12/3.412/AD8,\"\"))),\"\")","v":""},{"$f":"MAX(IF(X8=\"Yes\",(K8*BH8*CA8-AF8*BN8*CJ8),(K8*BH8*BZ8-AF8*BN8*CI8))*BU8*BY8-BF8,0)","v":{"$error":"#N/A"}},{"$f":"MAX(IF(X8=\"Yes\",(K8*BH8*CA8-AF8*BN8*CJ8),(K8*BH8*BZ8-AF8*BN8*CI8))*BX8*BY8-BF8,0)","v":{"$error":"#N/A"}},{"$f":"MAX((K8*BH8*CA8-AF8*BN8*CJ8)*BV8*BY8-BF8*8760,0)","v":{"$error":"#N/A"}},{"$f":"MAX(IFERROR((K8*BH8*CB8-AF8*BP8*CK8)*BW8*BY8,0),0)","v":0},{"$f":"AF8*BN8*IF(X8=\"Yes\",(CD8-CJ8),(CC8-CI8))*BU8*BY8","v":{"$error":"#N/A"}},{"$f":"AF8*BN8*IF(X8=\"Yes\",(CD8-CJ8),(CC8-CI8))*BX8*BY8","v":{"$error":"#N/A"}},{"$f":"AF8*BN8*(CD8-CJ8)*BV8*BY8","v":{"$error":"#N/A"}},{"$f":"AF8*BP8*(CE8-CK8)*BW8*BY8","v":{"$error":"#VALUE!"}},{"$f":"AF8*BN8*IF(X8=\"Yes\",(CG8-CJ8),(CF8-CI8))*BU8*BY8","v":{"$error":"#N/A"}},{"$f":"AF8*BN8*IF(X8=\"Yes\",(CG8-CJ8),(CF8-CI8))*BX8*BY8","v":{"$error":"#N/A"}},{"$f":"AF8*BN8*(CG8-CJ8)*BV8*BY8","v":{"$error":"#N/A"}},{"$f":"AF8*BP8*(CH8-CK8)*BW8*BY8","v":{"$error":"#VALUE!"}},{"$f":"IF(AND($AB8=\"\",IFERROR(SEARCH(\"Room\",P8)<0,TRUE),IFERROR(SEARCH(\"Terminal\",P8)<0,TRUE)),0,IFERROR(IF($B8=\"Early Retirement\",DW8,IF($B8=\"Replace on Burnout\",CP8,IF($B8=\"New Construction\",CT8,0))),0))","v":0},{"$f":"IF(AND($AB8=\"\",IFERROR(SEARCH(\"Room\",P8)<0,TRUE),IFERROR(SEARCH(\"Terminal\",P8)<0,TRUE)),0,IFERROR(IF($B8=\"Early Retirement\",DX8,IF($B8=\"Replace on Burnout\",CQ8,IF($B8=\"New Construction\",CU8,0))),0))","v":0},{"$f":"IF($AA8=\"\",0,IFERROR(IF($B8=\"Early Retirement\",DY8,IF($B8=\"Replace on Burnout\",CR8,IF($B8=\"New Construction\",CV8,0))),0))","v":0},{"$f":"IF($AA8=\"\",0,IFERROR(IF($B8=\"Early Retirement\",DZ8,IF($B8=\"Replace on Burnout\",CS8,IF($B8=\"New Construction\",CW8,0))),0))","v":0},{"$f":"INDEX('Utility Admin'!$P$2:$AD$2,1,MATCH($P8,'Utility Admin'!$P$3:$AD$3,0))","v":{"$error":"#N/A"}},{"$f":"INDEX('Utility Admin'!AE$2:AS$2,1,MATCH($P8,'Utility Admin'!$P$3:$AD$3,0))","v":{"$error":"#N/A"}},{"$f":"IF(kWhOverride=\"\",INDEX('Utility Admin'!$AT$2:$BH$2,1,MATCH($P8,'Utility Admin'!$P$3:$AD$3,0)),kWhOverride)","v":{"$error":"#N/A"}},{"$f":"IF(B8=\"New Construction\",\"\",IF(L8=\"\",\"\",MAX(DF$3-BK8,1,)))","v":""},{"$f":"INDEX('Equipment Lookups'!$AF$5:$BS$46,MATCH(Inventory!BL8,'Equipment Lookups'!$J$5:$J$46,0),MATCH(Inventory!DE8,'Equipment Lookups'!$AF$4:$BS$4,0))","v":{"$error":"#N/A"}},{"$f":"INDEX('Equipment Lookups'!$AE$5:$AE$46,MATCH(Inventory!BR8,'Equipment Lookups'!$J$5:$J$46,0))","v":{"$error":"#N/A"}},{"$f":"DG8-DF8","v":{"$error":"#N/A"}},{"$f":" ACkW * (1+escalation)/(discount-escalation) * (1 - ((1+escalation)/(1+discount))^DF8) * CL8","v":{"$error":"#N/A"}},{"$f":" ACkW * (1+escalation)/(discount-escalation) * (1 - ((1+escalation)/(1+discount))^DH8) * (1+escalation)^DF8/(1+discount)^DF8 * CP8","v":{"$error":"#N/A"}},{"$f":" ACkW * (1+escalation)/(discount-escalation) * (1 - ((1+escalation)/(1+discount))^DF8) * CM8","v":{"$error":"#N/A"}},{"$f":" ACkW * (1+escalation)/(discount-escalation) * (1 - ((1+escalation)/(1+discount))^DH8) * (1+escalation)^DF8/(1+discount)^DF8 * CQ8","v":{"$error":"#N/A"}},{"$f":" ACkWh * (1+escalation)/(discount-escalation) * (1 - ((1+escalation)/(1+discount))^DF8) * CN8","v":{"$error":"#N/A"}},{"$f":" ACkWh * (1+escalation)/(discount-escalation) * (1 - ((1+escalation)/(1+discount))^DH8) * (1+escalation)^DF8/(1+discount)^DF8 * CR8","v":{"$error":"#N/A"}},{"$f":" ACkWh * (1+escalation)/(discount-escalation) * (1 - ((1+escalation)/(1+discount))^DF8) * CO8","v":{"$error":"#N/A"}},{"$f":" ACkWh * (1+escalation)/(discount-escalation) * (1 - ((1+escalation)/(1+discount))^DH8) * (1+escalation)^DF8/(1+discount)^DF8 * CS8","v":{"$error":"#N/A"}},{"$f":"DI8+DJ8","v":{"$error":"#N/A"}},{"$f":"DK8+DL8","v":{"$error":"#N/A"}},{"$f":"DM8+DN8","v":{"$error":"#N/A"}},{"$f":"DO8+DP8","v":{"$error":"#N/A"}},{"$f":" ACkW * (1+escalation)/(discount-escalation) * (1 - ((1+escalation)/(1+discount))^DG8)","v":{"$error":"#N/A"}},{"$f":" ACkWh * (1+escalation)/(discount-escalation) * (1 - ((1+escalation)/(1+discount))^DG8)","v":{"$error":"#N/A"}},{"$f":"DQ8/DU8","v":{"$error":"#N/A"}},{"$f":"DR8/DU8","v":{"$error":"#N/A"}},{"$f":"DS8/DV8","v":{"$error":"#N/A"}},{"$f":"DT8/DV8","v":{"$error":"#N/A"}},{"$f":"K8*IFERROR(IF(B8=\"Early Retirement\",CA8,CD8)*BN8*BV8,0)","v":0},{"$f":"K8*IFERROR(BN8*BU8*CC8,0)","v":0},{"$f":"IFERROR(AF8*BN8*BV8*CJ8,0)","v":0}]
[2,null,null,null,null,null,null,{"$f":"IFERROR(INDEX(DefaultUnits,MATCH(F9,EquipmentTypes,0),1),\"\")","v":""},null,null,null,null,null,null,null,null,null,{"$f":"IFERROR(INDEX(DefaultUnits,MATCH(P9,EquipmentTypes,0),1),\"\")","v":""},null,"",null,null,"","",null,null,null,null,{"$f":"IFERROR(INDEX(DefaultUnits,MATCH(P9,EquipmentTypes,0),3),\"\")","v":""},null,"",null,null,null,null,null,null,null,null,0,0,0,{"$f":"IFERROR(IF($AR$3<'Utility Admin'!$I$2,AR9,'Utility Admin'!$I$2/Inventory!$AR$3*AR9),0)","v":0},0,{"$f":"IFERROR(ProjectCost-SUM(AS10:AS33),0)","v":0},null,"","",{"$f":"AC9","v":""},"",{"$f":"AE9","v":""},null,0,0,0,"UNITS","",0,{"$f":"IF('Project Info'!$D$7=\"TX\",INDEX(EFLH!$AB$4:$AB$30,MATCH(C9,TX_EFLHSanAntonio[Building Type],0),1),'Project Info'!$D$7&\"EquipmentType\")","v":"EquipmentType"},0,{"$f":"IF(BE9=\"CAP\",BO9*1.2,BH9*12000)","v":0},{"$f":"IF(IFERROR(SEARCH(\"Terminal\",F9,1)>0,FALSE),\"\",HLOOKUP(BI9,'Equipment Lookups'!$L$4:$AB$46,VLOOKUP(Inventory!BL9,'Equipment Lookups'!$J$5:$K$46,2,FALSE),TRUE))","v":{"$error":"#N/A"}},{"$f":"IF(L9=\"Unknown\",YEAR(TODAY())-INDEX('Equipment Lookups'!$AC$5:$AC$38,MATCH(Inventory!BL9,'Equipment Lookups'!$J$5:$J$38,0)),L9)","v":0},"",{"$error":"#N/A"},0,{"$f":"BN9*12000","v":0},0,{"$f":"IF(IFERROR(SEARCH(\"Terminal\",P9,1)>0,FALSE),\"\",HLOOKUP(BO9,'Equipment Lookups'!$L$4:$AB$46,VLOOKUP(Inventory!BR9,'Equipment Lookups'!$J$5:$K$46,2,FALSE),TRUE))","v":{"$error":"#N/A"}},"",{"$error":"#N/A"},{"$f":"INDEX('Equipment Lookups'!$AD$5:$AD$46,MATCH(Inventory!BR9,'Equipment Lookups'!$J$5:$J$46,0))","v":{"$error":"#N/A"}},{"$f":"IFERROR(IF(AL9<>\"\",AL9,IF(State=\"TX\",INDEX(TX_EFLHSanAntonio[[CFAir Cooled Chiller]:[CFPTRoom]],MATCH(Inventory!C9,TX_EFLHSanAntonio[Building Type],0),MATCH(BT9,EFLH!$N$2:$Q$2,0)),VLOOKUP(C9,INDIRECT($BX$5),4,FALSE))),\"-\")","v":"-"},{"$f":"IFERROR(IF(AJ9<>\"\",AJ9,IF(State=\"TX\",INDEX(TX_EFLHSanAntonio[[EFLHcAir Cooled Chiller]:[EFLHcPTRoom]],MATCH(Inventory!C9,TX_EFLHSanAntonio[Building Type],0),MATCH(BT9,EFLH!$V$2:$Y$2,0)),VLOOKUP(C9,INDIRECT($BX$5),2,FALSE))),\"-\")","v":"-"},{"$f":"IFERROR(IF(AK9<>\"\",AK9,IF(State=\"TX\",INDEX(TX_EFLHSanAntonio[[EFLHhDX]:[EFLHhPTRoom]],MATCH(Inventory!C9,TX_EFLHSanAntonio[Building Type],0),MATCH(BT9,EFLH!$Z$2:$AA$2,0)),VLOOKUP(C9,INDIRECT($BX$5),3,FALSE))),\"-\")","v":"-"},{"$f":"IF(AM9<>\"\",AM9,IF(State=\"TX\",INDEX(TX_EFLHSanAntonio[[NCPAir Cooled Chiller]:[NCPPTRoom]],MATCH(Inventory!C9,TX_EFLHSanAntonio[Building Type],0),MATCH(BT9,EFLH!$R$2:$U$2,0)),0))","v":0},1,{"$error":"#N/A"},{"$error":"#N/A"},"",{"$f":"IF(AG9<>\"\",AG9,IF(IFERROR(SEARCH(\"Terminal\",P9,1)>0,FALSE),INDEX(INDIRECT(BS9),A9,MATCH(TRM,PTAC!$AC$9:$AE$9,0)),INDEX(INDIRECT(BS9),MATCH(TRM,BaselineRow,0),1)))","v":{"$error":"#N/A"}},{"$error":"#N/A"},{"$f":"IF(AI9<>\"\",12/3.412/AI9,IF(IFERROR(SEARCH(\"Heat\",P9,1)>0,FALSE),IF(IFERROR(SEARCH(\"Terminal\",P9,1)>0,FALSE),INDEX(INDIRECT(BS9),A9,3+MATCH(TRM,PTAC!$AC$9:$AE$9,0)),INDEX(INDIRECT(BS9),MATCH(TRM,BaselineRow,0),3)),\"\"))","v":""},{"$f":"IF(AG9<>\"\",AG9,IF(IFERROR(SEARCH(\"Terminal\",P9,1)>0,FALSE),INDEX(INDIRECT(BS9),A9,MATCH(TRM,PTAC!$AC$9:$AE$9,0)),INDEX(INDIRECT(BS9),MATCH(TRM,BaselineRow,0),1)))","v":{"$error":"#N/A"}},{"$error":"#N/A"},{"$f":"IF(AI9<>\"\",12/3.412/AI9,IF(IFERROR(SEARCH(\"Heat\",P9,1)>0,FALSE),IF(IFERROR(SEARCH(\"Terminal\",P9,1)>0,FALSE),INDEX(INDIRECT(BS9),A9,3+MATCH(TRM,PTAC!$AC$9:$AE$9,0)),INDEX(INDIRECT(BS9),MATCH(TRM,BaselineRow,0),3)),\"\"))","v":""},"","","",{"$error":"#N/A"},{"$error":"#N/A"},{"$error":"#N/A"},0,{"$error":"#N/A"},{"$error":"#N/A"},{"$error":"#N/A"},{"$error":"#VALUE!"},{"$error":"#N/A"},{"$error":"#N/A"},{"$error":"#N/A"},{"$error":"#VALUE!"},0,0,0,0,{"$f":"INDEX('Utility Admin'!$P$2:$AD$2,1,MATCH($P9,'Utility Admin'!$P$3:$AD$3,0))","v":{"$error":"#N/A"}},{"$f":"INDEX('Utility Admin'!AE$2:AS$2,1,MATCH($P9,'Utility Admin'!$P$3:$AD$3,0))","v":{"$error":"#N/A"}},{"$f":"IF(kWhOverride=\"\",INDEX('Utility Admin'!$AT$2:$BH$2,1,MATCH($P9,'Utility Admin'!$P$3:$AD$3,0)),kWhOverride)","v":{"$error":"#N/A"}},"",{"$f":"INDEX('Equipment Lookups'!$AF$5:$BS$46,MATCH(Inventory!BL9,'Equipment Lookups'!$J$5:$J$46,0),MATCH(Inventory!DE9,'Equipment Lookups'!$AF$4:$BS$4,0))","v":{"$error":"#N/A"}},{"$f":"INDEX('Equipment Lookups'!$AE$5:$AE$46,MATCH(Inventory!BR9,'Equipment Lookups'!$J$5:$J$46,0))","v":{"$error":"#N/A"}},{"$f":"DG9-DF9","v":{"$error":"#N/A"}},{"$error":"#N/A"},{"$error":"#N/A"},{"$error":"#N/A"},{"$error":"#N/A"},{"$error":"#N/A"},{"$error":"#N/A"},{"$error":"#N/A"},{"$error":"#N/A"},{"$error":"#N/A"},{"$error":"#N/A"},{"$error":"#N/A"},{"$error":"#N/A"},{"$error":"#N/A"},{"$error":"#N/A"},{"$error":"#N/A"},{"$f":"DR9/DU9","v":{"$error":"#N/A"}},{"$f":"DS9/DV9","v":{"$error":"#N/A"}},{"$f":"DT9/DV9","v":{"$error":"#N/A"}},0,0,{"$f":"IFERROR(AF9*BN9*BV9*CJ9,0)","v":0}]
[3,null,null,null,null,null,null,{"$f":"IFERROR(INDEX(DefaultUnits,MATCH(F10,EquipmentTypes,0),1),\"\")","v":""},null,null,null,null,null,null,null,null,null,{"$f":"IFERROR(INDEX(DefaultUnits,MATCH(P10,EquipmentTypes,0),1),\"\")","v":""},null,"",null,null,"","",null,null,null,null,{"$f":"IFERROR(INDEX(DefaultUnits,MATCH(P10,EquipmentTypes,0),3),\"\")","v":""},null,"",null,null,null,null,null,null,null,null,0,0,0,{"$f":"IFERROR(IF($AR$3<'Utility Admin'!$I$2,AR10,'Utility Admin'!$I$2/Inventory!$AR$3*AR10),0)","v":0},0,{"$f":"IFERROR(ProjectCost-SUM(AS11:AS34),0)","v":0},null,"","","","","",null,0,0,0,"UNITS","",0,{"$f":"IF('Project Info'!$D$7=\"TX\",INDEX(EFLH!$AB$4:$AB$30,MATCH(C10,TX_EFLHSanAntonio[Building Type],0),1),'Project Info'!$D$7&\"EquipmentType\")","v":"EquipmentType"},0,0,{"$f":"IF(IFERROR(SEARCH(\"Terminal\",F10,1)>0,FALSE),\"\",HLOOKUP(BI10,'Equipment Lookups'!$L$4:$AB$46,VLOOKUP(Inventory!BL10,'Equipment Lookups'!$J$5:$K$46,2,FALSE),TRUE))","v":{"$error":"#N/A"}},{"$f":"IF(L10=\"Unknown\",YEAR(TODAY())-INDEX('Equipment Lookups'!$AC$5:$AC$38,MATCH(Inventory!BL10,'Equipment Lookups'!$J$5:$J$38,0)),L10)","v":0},"",{"$error":"#N/A"},0,0,0,{"$f":"IF(IFERROR(SEARCH(\"Terminal\",P10,1)>0,FALSE),\"\",HLOOKUP(BO10,'Equipment Lookups'!$L$4:$AB$46,VLOOKUP(Inventory!BR10,'Equipment Lookups'!$J$5:$K$46,2,FALSE),TRUE))","v":{"$error":"#N/A"}},"",{"$error":"#N/A"},{"$f":"INDEX('Equipment Lookups'!$AD$5:$AD$46,MATCH(Inventory!BR10,'Equipment Lookups'!$J$5:$J$46,0))","v":{"$error":"#N/A"}},{"$f":"IFERROR(IF(AL10<>\"\",AL10,IF(State=\"TX\",INDEX(TX_EFLHSanAntonio[[CFAir Cooled Chiller]:[CFPTRoom]],MATCH(Inventory!C10,TX_EFLHSanAntonio[Building Type],0),MATCH(BT10,EFLH!$N$2:$Q$2,0)),VLOOKUP(C10,INDIRECT($BX$5),4,FALSE))),\"-\")","v":"-"},{"$f":"IFERROR(IF(AJ10<>\"\",AJ10,IF(State=\"TX\",INDEX(TX_EFLHSanAntonio[[EFLHcAir Cooled Chiller]:[EFLHcPTRoom]],MATCH(Inventory!C10,TX_EFLHSanAntonio[Building Type],0),MATCH(BT10,EFLH!$V$2:$Y$2,0)),VLOOKUP(C10,INDIRECT($BX$5),2,FALSE))),\"-\")","v":"-"},{"$f":"IFERROR(IF(AK10<>\"\",AK10,IF(State=\"TX\",INDEX(TX_EFLHSanAntonio[[EFLHhDX]:[EFLHhPTRoom]],MATCH(Inventory!C10,TX_EFLHSanAntonio[Building Type],0),MATCH(BT10,EFLH!$Z$2:$AA$2,0)),VLOOKUP(C10,INDIRECT($BX$5),3,FALSE))),\"-\")","v":"-"},{"$f":"IF(AM10<>\"\",AM10,IF(State=\"TX\",INDEX(TX_EFLHSanAntonio[[NCPAir Cooled Chiller]:[NCPPTRoom]],MATCH(Inventory!C10,TX_EFLHSanAntonio[Building Type],0),MATCH(BT10,EFLH!$R$2:$U$2,0)),0))","v":0},1,{"$error":"#N/A"},{"$error":"#N/A"},"",{"$f":"IF(AG10<>\"\",AG10,IF(IFERROR(SEARCH(\"Terminal\",P10,1)>0,FALSE),INDEX(INDIRECT(BS10),A10,MATCH(TRM,PTAC!$AC$9:$AE$9,0)),INDEX(INDIRECT(BS10),MATCH(TRM,BaselineRow,0),1)))","v":{"$error":"#N/A"}},{"$error":"#N/A"},{"$f":"IF(AI10<>\"\",12/3.412/AI10,IF(IFERROR(SEARCH(\"Heat\",P10,1)>0,FALSE),IF(IFERROR(SEARCH(\"Terminal\",P10,1)>0,FALSE),INDEX(INDIRECT(BS10),A10,3+MATCH(TRM,PTAC!$AC$9:$AE$9,0)),INDEX(INDIRECT(BS10),MATCH(TRM,BaselineRow,0),3)),\"\"))","v":""},{"$f":"IF(AG10<>\"\",AG10,IF(IFERROR(SEARCH(\"Terminal\",P10,1)>0,FALSE),INDEX(INDIRECT(BS10),A10,MATCH(TRM,PTAC!$AC$9:$AE$9,0)),INDEX(INDIRECT(BS10),MATCH(TRM,BaselineRow,0),1)))","v":{"$error":"#N/A"}},{"$error":"#N/A"},{"$f":"IF(AI10<>\"\",12/3.412/AI10,IF(IFERROR(SEARCH(\"Heat\",P10,1)>0,FALSE),IF(IFERROR(SEARCH(\"Terminal\",P10,1)>0,FALSE),INDEX(INDIRECT(BS10),A10,3+MATCH(TRM,PTAC!$AC$9:$AE$9,0)),INDEX(INDIRECT(BS10),MATCH(TRM,BaselineRow,0),3)),\"\"))","v":""},"","","",{"$error":"#N/A"},{"$error":"#N/A"},{"$error":"#N/A"},0,{"$error":"#N/A"},{"$error":"#N/A"},{"$error":"#N/A"},{"$error":"#VALUE!"},{"$error":"#N/A"},{"$error":"#N/A"},{"$error":"#N/A"},{"$error":"#VALUE!"},0,0,0,0,{"$f":"INDEX('Utility Admin'!$P$2:$AD$2,1,MATCH($P10,'Utility Admin'!$P$3:$AD$3,0))","v":{"$error":"#N/A"}},{"$f":"INDEX('Utility Admin'!AE$2:AS$2,1,MATCH($P10,'Utility Admin'!$P$3:$AD$3,0))","v":{"$error":"#N/A"}},{"$f":"IF(kWhOverride=\"\",INDEX('Utility Admin'!$AT$2:$BH$2,1,MATCH($P10,'Utility Admin'!$P$3:$AD$3,0)),kWhOverride)","v":{"$error":"#N/A"}},"",{"$f":"INDEX('Equipment Lookups'!$AF$5:$BS$46,MATCH(Inventory!BL10,'Equipment Lookups'!$J$5:$J$46,0),MATCH(Inventory!DE10,'Equipment Lookups'!$AF$4:$BS$4,0))","v":{"$error":"#N/A"}},{"$f":"INDEX('Equipment Lookups'!$AE$5:$AE$46,MATCH(Inventory!BR10,'Equipment Lookups'!$J$5:$J$46,0))","v":{"$error":"#N/A"}},{"$error":"#N/A"},{"$error":"#N/A"},{"$error":"#N/A"},{"$error":"#N/A"},{"$error":"#N/A"},{"$error":"#N/A"},{"$error":"#N/A"},{"$error":"#N/A"},{"$error":"#N/A"},{"$error":"#N/A"},{"$error":"#N/A"},{"$error":"#N/A"},{"$error":"#N/A"},{"$error":"#N/A"},{"$error":"#N/A"},{"$error":"#N/A"},{"$error":"#N/A"},{"$error":"#N/A"},{"$error":"#N/A"},0,0,0]
[4,null,null,null,null,null,null,{"$f":"IFERROR(INDEX(DefaultUnits,MATCH(F11,EquipmentTypes,0),1),\"\")","v":""},null,null,null,null,null,null,null,null,null,{"$f":"IFERROR(INDEX(DefaultUnits,MATCH(P11,EquipmentTypes,0),1),\"\")","v":""},null,"",null,null,"","",null,null,null,null,{"$f":"IFERROR(INDEX(DefaultUnits,MATCH(P11,EquipmentTypes,0),3),\"\")","v":""},null,"",null,null,null,null,null,null,null,null,0,0,0,{"$f":"IFERROR(IF($AR$3<'Utility Admin'!$I$2,AR11,'Utility Admin'!$I$2/Inventory!$AR$3*AR11),0)","v":0},0,{"$f":"IFERROR(ProjectCost-SUM(AS12:AS35),0)","v":0},null,"","","","","",null,0,0,0,"UNITS","",0,{"$f":"IF('Project Info'!$D$7=\"TX\",INDEX(EFLH!$AB$4:$AB$30,MATCH(C11,TX_EFLHSanAntonio[Building Type],0),1),'Project Info'!$D$7&\"EquipmentType\")","v":"EquipmentType"},0,0,{"$f":"IF(IFERROR(SEARCH(\"Terminal\",F11,1)>0,FALSE),\"\",HLOOKUP(BI11,'Equipment Lookups'!$L$4:$AB$46,VLOOKUP(Inventory!BL11,'Equipment Lookups'!$J$5:$K$46,2,FALSE),TRUE))","v":{"$error":"#N/A"}},{"$f":"IF(L11=\"Unknown\",YEAR(TODAY())-INDEX('Equipment Lookups'!$AC$5:$AC$38,MATCH(Inventory!BL11,'Equipment Lookups'!$J$5:$J$38,0)),L11)","v":0},"",{"$error":"#N/A"},0,0,0,{"$f":"IF(IFERROR(SEARCH(\"Terminal\",P11,1)>0,FALSE),\"\",HLOOKUP(BO11,'Equipment Lookups'!$L$4:$AB$46,VLOOKUP(Inventory!BR11,'Equipment Lookups'!$J$5:$K$46,2,FALSE),TRUE))","v":{"$error":"#N/A"}},"",{"$error":"#N/A"},{"$f":"INDEX('Equipment Lookups'!$AD$5:$AD$46,MATCH(Inventory!BR11,'Equipment Lookups'!$J$5:$J$46,0))","v":{"$error":"#N/A"}},{"$f":"IFERROR(IF(AL11<>\"\",AL11,IF(State=\"TX\",INDEX(TX_EFLHSanAntonio[[CFAir Cooled Chiller]:[CFPTRoom]],MATCH(Inventory!C11,TX_EFLHSanAntonio[Building Type],0),MATCH(BT11,EFLH!$N$2:$Q$2,0)),VLOOKUP(C11,INDIRECT($BX$5),4,FALSE))),\"-\")","v":"-"},{"$f":"IFERROR(IF(AJ11<>\"\",AJ11,IF(State=\"TX\",INDEX(TX_EFLHSanAntonio[[EFLHcAir Cooled Chiller]:[EFLHcPTRoom]],MATCH(Inventory!C11,TX_EFLHSanAntonio[Building Type],0),MATCH(BT11,EFLH!$V$2:$Y$2,0)),VLOOKUP(C11,INDIRECT($BX$5),2,FALSE))),\"-\")","v":"-"},{"$f":"IFERROR(IF(AK11<>\"\",AK11,IF(State=\"TX\",INDEX(TX_EFLHSanAntonio[[EFLHhDX]:[EFLHhPTRoom]],MATCH(Inventory!C11,TX_EFLHSanAntonio[Building Type],0),MATCH(BT11,EFLH!$Z$2:$AA$2,0)),VLOOKUP(C11,INDIRECT($BX$5),3,FALSE))),\"-\")","v":"-"},{"$f":"IF(AM11<>\"\",AM11,IF(State=\"TX\",INDEX(TX_EFLHSanAntonio[[NCPAir Cooled Chiller]:[NCPPTRoom]],MATCH(Inventory!C11,TX_EFLHSanAntonio[Building Type],0),MATCH(BT11,EFLH!$R$2:$U$2,0)),0))","v":0},1,{"$error":"#N/A"},{"$error":"#N/A"},"",{"$f":"IF(AG11<>\"\",AG11,IF(IFERROR(SEARCH(\"Terminal\",P11,1)>0,FALSE),INDEX(INDIRECT(BS11),A11,MATCH(TRM,PTAC!$AC$9:$AE$9,0)),INDEX(INDIRECT(BS11),MATCH(TRM,BaselineRow,0),1)))","v":{"$error":"#N/A"}},{"$error":"#N/A"},{"$f":"IF(AI11<>\"\",12/3.412/AI11,IF(IFERROR(SEARCH(\"Heat\",P11,1)>0,FALSE),IF(IFERROR(SEARCH(\"Terminal\",P11,1)>0,FALSE),INDEX(INDIRECT(BS11),A11,3+MATCH(TRM,PTAC!$AC$9:$AE$9,0)),INDEX(INDIRECT(BS11),MATCH(TRM,BaselineRow,0),3)),\"\"))","v":""},{"$f":"IF(AG11<>\"\",AG11,IF(IFERROR(SEARCH(\"Terminal\",P11,1)>0,FALSE),INDEX(INDIRECT(BS11),A11,MATCH(TRM,PTAC!$AC$9:$AE$9,0)),INDEX(INDIRECT(BS11),MATCH(TRM,BaselineRow,0),1)))","v":{"$error":"#N/A"}},{"$error":"#N/A"},{"$f":"IF(AI11<>\"\",12/3.412/AI11,IF(IFERROR(SEARCH(\"Heat\",P11,1)>0,FALSE),IF(IFERROR(SEARCH(\"Terminal\",P11,1)>0,FALSE),INDEX(INDIRECT(BS11),A11,3+MATCH(TRM,PTAC!$AC$9:$AE$9,0)),INDEX(INDIRECT(BS11),MATCH(TRM,BaselineRow,0),3)),\"\"))","v":""},"","","",{"$error":"#N/A"},{"$error":"#N/A"},{"$error":"#N/A"},0,{"$error":"#N/A"},{"$error":"#N/A"},{"$error":"#N/A"},{"$error":"#VALUE!"},{"$error":"#N/A"},{"$error":"#N/A"},{"$error":"#N/A"},{"$error":"#VALUE!"},0,0,0,0,{"$f":"INDEX('Utility Admin'!$P$2:$AD$2,1,MATCH($P11,'Utility Admin'!$P$3:$AD$3,0))","v":{"$error":"#N/A"}},{"$f":"INDEX('Utility Admin'!AE$2:AS$2,1,MATCH($P11,'Utility Admin'!$P$3:$AD$3,0))","v":{"$error":"#N/A"}},{"$f":"IF(kWhOverride=\"\",INDEX('Utility Admin'!$AT$2:$BH$2,1,MATCH($P11,'Utility Admin'!$P$3:$AD$3,0)),kWhOverride)","v":{"$error":"#N/A"}},"",{"$f":"INDEX('Equipment Lookups'!$AF$5:$BS$46,MATCH(Inventory!BL11,'Equipment Lookups'!$J$5:$J$46,0),MATCH(Inventory!DE11,'Equipment Lookups'!$AF$4:$BS$4,0))","v":{"$error":"#N/A"}},{"$f":"INDEX('Equipment Lookups'!$AE$5:$AE$46,MATCH(Inventory!BR11,'Equipment Lookups'!$J$5:$J$46,0))","v":{"$error":"#N/A"}},{"$error":"#N/A"},{"$error":"#N/A"},{"$error":"#N/A"},{"$error":"#N/A"},{"$error":"#N/A"},{"$error":"#N/A"},{"$error":"#N/A"},{"$error":"#N/A"},{"$error":"#N/A"},{"$error":"#N/A"},{"$error":"#N/A"},{"$error":"#N/A"},{"$error":"#N/A"},{"$error":"#N/A"},{"$error":"#N/A"},{"$error":"#N/A"},{"$error":"#N/A"},{"$error":"#N/A"},{"$error":"#N/A"},0,0,0]
[5,null,null,null,null,null,null,{"$f":"IFERROR(INDEX(DefaultUnits,MATCH(F12,EquipmentTypes,0),1),\"\")","v":""},null,null,null,null,null,null,null,null,null,{"$f":"IFERROR(INDEX(DefaultUnits,MATCH(P12,EquipmentTypes,0),1),\"\")","v":""},null,"",null,null,"","",null,null,null,null,{"$f":"IFERROR(INDEX(DefaultUnits,MATCH(P12,EquipmentTypes,0),3),\"\")","v":""},null,"",null,null,null,null,null,null,null,null,0,0,0,{"$f":"IFERROR(IF($AR$3<'Utility Admin'!$I$2,AR12,'Utility Admin'!$I$2/Inventory!$AR$3*AR12),0)","v":0},0,{"$f":"IFERROR(ProjectCost-SUM(AS13:AS36),0)","v":0},null,"","","","","",null,0,0,0,"UNITS","",0,{"$f":"IF('Project Info'!$D$7=\"TX\",INDEX(EFLH!$AB$4:$AB$30,MATCH(C12,TX_EFLHSanAntonio[Building Type],0),1),'Project Info'!$D$7&\"EquipmentType\")","v":"EquipmentType"},0,0,{"$f":"IF(IFERROR(SEARCH(\"Terminal\",F12,1)>0,FALSE),\"\",HLOOKUP(BI12,'Equipment Lookups'!$L$4:$AB$46,VLOOKUP(Inventory!BL12,'Equipment Lookups'!$J$5:$K$46,2,FALSE),TRUE))","v":{"$error":"#N/A"}},{"$f":"IF(L12=\"Unknown\",YEAR(TODAY())-INDEX('Equipment Lookups'!$AC$5:$AC$38,MATCH(Inventory!BL12,'Equipment Lookups'!$J$5:$J$38,0)),L12)","v":0},"",{"$error":"#N/A"},0,0,0,{"$f":"IF(IFERROR(SEARCH(\"Terminal\",P12,1)>0,FALSE),\"\",HLOOKUP(BO12,'Equipment Lookups'!$L$4:$AB$46,VLOOKUP(Inventory!BR12,'Equipment Lookups'!$J$5:$K$46,2,FALSE),TRUE))","v":{"$error":"#N/A"}},"",{"$error":"#N/A"},{"$f":"INDEX('Equipment Lookups'!$AD$5:$AD$46,MATCH(Inventory!BR12,'Equipment Lookups'!$J$5:$J$46,0))","v":{"$error":"#N/A"}},{"$f":"IFERROR(IF(AL12<>\"\",AL12,IF(State=\"TX\",INDEX(TX_EFLHSanAntonio[[CFAir Cooled Chiller]:[CFPTRoom]],MATCH(Inventory!C12,TX_EFLHSanAntonio[Building Type],0),MATCH(BT12,EFLH!$N$2:$Q$2,0)),VLOOKUP(C12,INDIRECT($BX$5),4,FALSE))),\"-\")","v":"-"},{"$f":"IFERROR(IF(AJ12<>\"\",AJ12,IF(State=\"TX\",INDEX(TX_EFLHSanAntonio[[EFLHcAir Cooled Chiller]:[EFLHcPTRoom]],MATCH(Inventory!C12,TX_EFLHSanAntonio[Building Type],0),MATCH(BT12,EFLH!$V$2:$Y$2,0)),VLOOKUP(C12,INDIRECT($BX$5),2,FALSE))),\"-\")","v":"-"},{"$f":"IFERROR(IF(AK12<>\"\",AK12,IF(State=\"TX\",INDEX(TX_EFLHSanAntonio[[EFLHhDX]:[EFLHhPTRoom]],MATCH(Inventory!C12,TX_EFLHSanAntonio[Building Type],0),MATCH(BT12,EFLH!$Z$2:$AA$2,0)),VLOOKUP(C12,INDIRECT($BX$5),3,FALSE))),\"-\")","v":"-"},{"$f":"IF(AM12<>\"\",AM12,IF(State=\"TX\",INDEX(TX_EFLHSanAntonio[[NCPAir Cooled Chiller]:[NCPPTRoom]],MATCH(Inventory!C12,TX_EFLHSanAntonio[Building Type],0),MATCH(BT12,EFLH!$R$2:$U$2,0)),0))","v":0},1,{"$error":"#N/A"},{"$error":"#N/A"},"",{"$f":"IF(AG12<>\"\",AG12,IF(IFERROR(SEARCH(\"Terminal\",P12,1)>0,FALSE),INDEX(INDIRECT(BS12),A12,MATCH(TRM,PTAC!$AC$9:$AE$9,0)),INDEX(INDIRECT(BS12),MATCH(TRM,BaselineRow,0),1)))","v":{"$error":"#N/A"}},{"$error":"#N/A"},{"$f":"IF(AI12<>\"\",12/3.412/AI12,IF(IFERROR(SEARCH(\"Heat\",P12,1)>0,FALSE),IF(IFERROR(SEARCH(\"Terminal\",P12,1)>0,FALSE),INDEX(INDIRECT(BS12),A12,3+MATCH(TRM,PTAC!$AC$9:$AE$9,0)),INDEX(INDIRECT(BS12),MATCH(TRM,BaselineRow,0),3)),\"\"))","v":""},{"$f":"IF(AG12<>\"\",AG12,IF(IFERROR(SEARCH(\"Terminal\",P12,1)>0,FALSE),INDEX(INDIRECT(BS12),A12,MATCH(TRM,PTAC!$AC$9:$AE$9,0)),INDEX(INDIRECT(BS12),MATCH(TRM,BaselineRow,0),1)))","v":{"$error":"#N/A"}},{"$error":"#N/A"},{"$f":"IF(AI12<>\"\",12/3.412/AI12,IF(IFERROR(SEARCH(\"Heat\",P12,1)>0,FALSE),IF(IFERROR(SEARCH(\"Terminal\",P12,1)>0,FALSE),INDEX(INDIRECT(BS12),A12,3+MATCH(TRM,PTAC!$AC$9:$AE$9,0)),INDEX(INDIRECT(BS12),MATCH(TRM,BaselineRow,0),3)),\"\"))","v":""},"","","",{"$error":"#N/A"},{"$error":"#N/A"},{"$error":"#N/A"},0,{"$error":"#N/A"},{"$error":"#N/A"},{"$error":"#N/A"},{"$error":"#VALUE!"},{"$error":"#N/A"},{"$error":"#N/A"},{"$error":"#N/A"},{"$error":"#VALUE!"},0,0,0,0,{"$f":"INDEX('Utility Admin'!$P$2:$AD$2,1,MATCH($P12,'Utility Admin'!$P$3:$AD$3,0))","v":{"$error":"#N/A"}},{"$f":"INDEX('Utility Admin'!AE$2:AS$2,1,MATCH($P12,'Utility Admin'!$P$3:$AD$3,0))","v":{"$error":"#N/A"}},{"$f":"IF(kWhOverride=\"\",INDEX('Utility Admin'!$AT$2:$BH$2,1,MATCH($P12,'Utility Admin'!$P$3:$AD$3,0)),kWhOverride)","v":{"$error":"#N/A"}},"",{"$f":"INDEX('Equipment Lookups'!$AF$5:$BS$46,MATCH(Inventory!BL12,'Equipment Lookups'!$J$5:$J$46,0),MATCH(Inventory!DE12,'Equipment Lookups'!$AF$4:$BS$4,0))","v":{"$error":"#N/A"}},{"$f":"INDEX('Equipment Lookups'!$AE$5:$AE$46,MATCH(Inventory!BR12,'Equipment Lookups'!$J$5:$J$46,0))","v":{"$error":"#N/A"}},{"$error":"#N/A"},{"$error":"#N/A"},{"$error":"#N/A"},{"$error":"#N/A"},{"$error":"#N/A"},{"$error":"#N/A"},{"$error":"#N/A"},{"$error":"#N/A"},{"$error":"#N/A"},{"$error":"#N/A"},{"$error":"#N/A"},{"$error":"#N/A"},{"$error":"#N/A"},{"$error":"#N/A"},{"$error":"#N/A"},{"$error":"#N/A"},{"$error":"#N/A"},{"$error":"#N/A"},{"$error":"#N/A"},0,0,0]
[6,null,null,null,null,null,null,{"$f":"IFERROR(INDEX(DefaultUnits,MATCH(F13,EquipmentTypes,0),1),\"\")","v":""},null,null,null,null,null,null,null,null,null,{"$f":"IFERROR(INDEX(DefaultUnits,MATCH(P13,EquipmentTypes,0),1),\"\")","v":""},null,"",null,null,"","",null,null,null,null,{"$f":"IFERROR(INDEX(DefaultUnits,MATCH(P13,EquipmentTypes,0),3),\"\")","v":""},null,"",null,null,null,null,null,null,null,null,0,0,0,{"$f":"IFERROR(IF($AR$3<'Utility Admin'!$I$2,AR13,'Utility Admin'!$I$2/Inventory!$AR$3*AR13),0)","v":0},0,{"$f":"IFERROR(ProjectCost-SUM(AS14:AS37),0)","v":0},null,"","","","","",null,0,0,0,"UNITS","",0,{"$f":"IF('Project Info'!$D$7=\"TX\",INDEX(EFLH!$AB$4:$AB$30,MATCH(C13,TX_EFLHSanAntonio[Building Type],0),1),'Project Info'!$D$7&\"EquipmentType\")","v":"EquipmentType"},0,0,{"$f":"IF(IFERROR(SEARCH(\"Terminal\",F13,1)>0,FALSE),\"\",HLOOKUP(BI13,'Equipment Lookups'!$L$4:$AB$46,VLOOKUP(Inventory!BL13,'Equipment Lookups'!$J$5:$K$46,2,FALSE),TRUE))","v":{"$error":"#N/A"}},{"$f":"IF(L13=\"Unknown\",YEAR(TODAY())-INDEX('Equipment Lookups'!$AC$5:$AC$38,MATCH(Inventory!BL13,'Equipment Lookups'!$J$5:$J$38,0)),L13)","v":0},"",{"$error":"#N/A"},0,0,0,{"$f":"IF(IFERROR(SEARCH(\"Terminal\",P13,1)>0,FALSE),\"\",HLOOKUP(BO13,'Equipment Lookups'!$L$4:$AB$46,VLOOKUP(Inventory!BR13,'Equipment Lookups'!$J$5:$K$46,2,FALSE),TRUE))","v":{"$error":"#N/A"}},"",{"$error":"#N/A"},{"$f":"INDEX('Equipment Lookups'!$AD$5:$AD$46,MATCH(Inventory!BR13,'Equipment Lookups'!$J$5:$J$46,0))","v":{"$error":"#N/A"}},{"$f":"IFERROR(IF(AL13<>\"\",AL13,IF(State=\"TX\",INDEX(TX_EFLHSanAntonio[[CFAir Cooled Chiller]:[CFPTRoom]],MATCH(Inventory!C13,TX_EFLHSanAntonio[Building Type],0),MATCH(BT13,EFLH!$N$2:$Q$2,0)),VLOOKUP(C13,INDIRECT($BX$5),4,FALSE))),\"-\")","v":"-"},{"$f":"IFERROR(IF(AJ13<>\"\",AJ13,IF(State=\"TX\",INDEX(TX_EFLHSanAntonio[[EFLHcAir Cooled Chiller]:[EFLHcPTRoom]],MATCH(Inventory!C13,TX_EFLHSanAntonio[Building Type],0),MATCH(BT13,EFLH!$V$2:$Y$2,0)),VLOOKUP(C13,INDIRECT($BX$5),2,FALSE))),\"-\")","v":"-"},{"$f":"IFERROR(IF(AK13<>\"\",AK13,IF(State=\"TX\",INDEX(TX_EFLHSanAntonio[[EFLHhDX]:[EFLHhPTRoom]],MATCH(Inventory!C13,TX_EFLHSanAntonio[Building Type],0),MATCH(BT13,EFLH!$Z$2:$AA$2,0)),VLOOKUP(C13,INDIRECT($BX$5),3,FALSE))),\"-\")","v":"-"},{"$f":"IF(AM13<>\"\",AM13,IF(State=\"TX\",INDEX(TX_EFLHSanAntonio[[NCPAir Cooled Chiller]:[NCPPTRoom]],MATCH(Inventory!C13,TX_EFLHSanAntonio[Building Type],0),MATCH(BT13,EFLH!$R$2:$U$2,0)),0))","v":0},1,{"$error":"#N/A"},{"$error":"#N/A"},"",{"$f":"IF(AG13<>\"\",AG13,IF(IFERROR(SEARCH(\"Terminal\",P13,1)>0,FALSE),INDEX(INDIRECT(BS13),A13,MATCH(TRM,PTAC!$AC$9:$AE$9,0)),INDEX(INDIRECT(BS13),MATCH(TRM,BaselineRow,0),1)))","v":{"$error":"#N/A"}},{"$error":"#N/A"},{"$f":"IF(AI13<>\"\",12/3.412/AI13,IF(IFERROR(SEARCH(\"Heat\",P13,1)>0,FALSE),IF(IFERROR(SEARCH(\"Terminal\",P13,1)>0,FALSE),INDEX(INDIRECT(BS13),A13,3+MATCH(TRM,PTAC!$AC$9:$AE$9,0)),INDEX(INDIRECT(BS13),MATCH(TRM,BaselineRow,0),3)),\"\"))","v":""},{"$f":"IF(AG13<>\"\",AG13,IF(IFERROR(SEARCH(\"Terminal\",P13,1)>0,FALSE),INDEX(INDIRECT(BS13),A13,MATCH(TRM,PTAC!$AC$9:$AE$9,0)),INDEX(INDIRECT(BS13),MATCH(TRM,BaselineRow,0),1)))","v":{"$error":"#N/A"}},{"$error":"#N/A"},{"$f":"IF(AI13<>\"\",12/3.412/AI13,IF(IFERROR(SEARCH(\"Heat\",P13,1)>0,FALSE),IF(IFERROR(SEARCH(\"Terminal\",P13,1)>0,FALSE),INDEX(INDIRECT(BS13),A13,3+MATCH(TRM,PTAC!$AC$9:$AE$9,0)),INDEX(INDIRECT(BS13),MATCH(TRM,BaselineRow,0),3)),\"\"))","v":""},"","","",{"$error":"#N/A"},{"$error":"#N/A"},{"$error":"#N/A"},0,{"$error":"#N/A"},{"$error":"#N/A"},{"$error":"#N/A"},{"$error":"#VALUE!"},{"$error":"#N/A"},{"$error":"#N/A"},{"$error":"#N/A"},{"$error":"#VALUE!"},0,0,0,0,{"$f":"INDEX('Utility Admin'!$P$2:$AD$2,1,MATCH($P13,'Utility Admin'!$P$3:$AD$3,0))","v":{"$error":"#N/A"}},{"$f":"INDEX('Utility Admin'!AE$2:AS$2,1,MATCH($P13,'Utility Admin'!$P$3:$AD$3,0))","v":{"$error":"#N/A"}},{"$f":"IF(kWhOverride=\"\",INDEX('Utility Admin'!$AT$2:$BH$2,1,MATCH($P13,'Utility Admin'!$P$3:$AD$3,0)),kWhOverride)","v":{"$error":"#N/A"}},"",{"$f":"INDEX('Equipment Lookups'!$AF$5:$BS$46,MATCH(Inventory!BL13,'Equipment Lookups'!$J$5:$J$46,0),MATCH(Inventory!DE13,'Equipment Lookups'!$AF$4:$BS$4,0))","v":{"$error":"#N/A"}},{"$f":"INDEX('Equipment Lookups'!$AE$5:$AE$46,MATCH(Inventory!BR13,'Equipment Lookups'!$J$5:$J$46,0))","v":{"$error":"#N/A"}},{"$error":"#N/A"},{"$error":"#N/A"},{"$error":"#N/A"},{"$error":"#N/A"},{"$error":"#N/A"},{"$error":"#N/A"},{"$error":"#N/A"},{"$error":"#N/A"},{"$error":"#N/A"},{"$error":"#N/A"},{"$error":"#N/A"},{"$error":"#N/A"},{"$error":"#N/A"},{"$error":"#N/A"},{"$error":"#N/A"},{"$error":"#N/A"},{"$error":"#N/A"},{"$error":"#N/A"},{"$error":"#N/A"},0,0,0]
[7,null,null,null,null,null,null,{"$f":"IFERROR(INDEX(DefaultUnits,MATCH(F14,EquipmentTypes,0),1),\"\")","v":""},null,null,null,null,null,null,null,null,null,{"$f":"IFERROR(INDEX(DefaultUnits,MATCH(P14,EquipmentTypes,0),1),\"\")","v":""},null,"",null,null,"","",null,null,null,null,{"$f":"IFERROR(INDEX(DefaultUnits,MATCH(P14,EquipmentTypes,0),3),\"\")","v":""},null,"",null,null,null,null,null,null,null,null,0,0,0,{"$f":"IFERROR(IF($AR$3<'Utility Admin'!$I$2,AR14,'Utility Admin'!$I$2/Inventory!$AR$3*AR14),0)","v":0},0,{"$f":"IFERROR(ProjectCost-SUM(AS15:AS38),0)","v":0},null,"","","","","",null,0,0,0,"UNITS","",0,{"$f":"IF('Project Info'!$D$7=\"TX\",INDEX(EFLH!$AB$4:$AB$30,MATCH(C14,TX_EFLHSanAntonio[Building Type],0),1),'Project Info'!$D$7&\"EquipmentType\")","v":"EquipmentType"},0,0,{"$f":"IF(IFERROR(SEARCH(\"Terminal\",F14,1)>0,FALSE),\"\",HLOOKUP(BI14,'Equipment Lookups'!$L$4:$AB$46,VLOOKUP(Inventory!BL14,'Equipment Lookups'!$J$5:$K$46,2,FALSE),TRUE))","v":{"$error":"#N/A"}},{"$f":"IF(L14=\"Unknown\",YEAR(TODAY())-INDEX('Equipment Lookups'!$AC$5:$AC$38,MATCH(Inventory!BL14,'Equipment Lookups'!$J$5:$J$38,0)),L14)","v":0},"",{"$error":"#N/A"},0,0,0,{"$f":"IF(IFERROR(SEARCH(\"Terminal\",P14,1)>0,FALSE),\"\",HLOOKUP(BO14,'Equipment Lookups'!$L$4:$AB$46,VLOOKUP(Inventory!BR14,'Equipment Lookups'!$J$5:$K$46,2,FALSE),TRUE))","v":{"$error":"#N/A"}},"",{"$error":"#N/A"},{"$f":"INDEX('Equipment Lookups'!$AD$5:$AD$46,MATCH(Inventory!BR14,'Equipment Lookups'!$J$5:$J$46,0))","v":{"$error":"#N/A"}},{"$f":"IFERROR(IF(AL14<>\"\",AL14,IF(State=\"TX\",INDEX(TX_EFLHSanAntonio[[CFAir Cooled Chiller]:[CFPTRoom]],MATCH(Inventory!C14,TX_EFLHSanAntonio[Building Type],0),MATCH(BT14,EFLH!$N$2:$Q$2,0)),VLOOKUP(C14,INDIRECT($BX$5),4,FALSE))),\"-\")","v":"-"},{"$f":"IFERROR(IF(AJ14<>\"\",AJ14,IF(State=\"TX\",INDEX(TX_EFLHSanAntonio[[EFLHcAir Cooled Chiller]:[EFLHcPTRoom]],MATCH(Inventory!C14,TX_EFLHSanAntonio[Building Type],0),MATCH(BT14,EFLH!$V$2:$Y$2,0)),VLOOKUP(C14,INDIRECT($BX$5),2,FALSE))),\"-\")","v":"-"},{"$f":"IFERROR(IF(AK14<>\"\",AK14,IF(State=\"TX\",INDEX(TX_EFLHSanAntonio[[EFLHhDX]:[EFLHhPTRoom]],MATCH(Inventory!C14,TX_EFLHSanAntonio[Building Type],0),MATCH(BT14,EFLH!$Z$2:$AA$2,0)),VLOOKUP(C14,INDIRECT($BX$5),3,FALSE))),\"-\")","v":"-"},{"$f":"IF(AM14<>\"\",AM14,IF(State=\"TX\",INDEX(TX_EFLHSanAntonio[[NCPAir Cooled Chiller]:[NCPPTRoom]],MATCH(Inventory!C14,TX_EFLHSanAntonio[Building Type],0),MATCH(BT14,EFLH!$R$2:$U$2,0)),0))","v":0},1,{"$error":"#N/A"},{"$error":"#N/A"},"",{"$f":"IF(AG14<>\"\",AG14,IF(IFERROR(SEARCH(\"Terminal\",P14,1)>0,FALSE),INDEX(INDIRECT(BS14),A14,MATCH(TRM,PTAC!$AC$9:$AE$9,0)),INDEX(INDIRECT(BS14),MATCH(TRM,BaselineRow,0),1)))","v":{"$error":"#N/A"}},{"$error":"#N/A"},{"$f":"IF(AI14<>\"\",12/3.412/AI14,IF(IFERROR(SEARCH(\"Heat\",P14,1)>0,FALSE),IF(IFERROR(SEARCH(\"Terminal\",P14,1)>0,FALSE),INDEX(INDIRECT(BS14),A14,3+MATCH(TRM,PTAC!$AC$9:$AE$9,0)),INDEX(INDIRECT(BS14),MATCH(TRM,BaselineRow,0),3)),\"\"))","v":""},{"$f":"IF(AG14<>\"\",AG14,IF(IFERROR(SEARCH(\"Terminal\",P14,1)>0,FALSE),INDEX(INDIRECT(BS14),A14,MATCH(TRM,PTAC!$AC$9:$AE$9,0)),INDEX(INDIRECT(BS14),MATCH(TRM,BaselineRow,0),1)))","v":{"$error":"#N/A"}},{"$error":"#N/A"},{"$f":"IF(AI14<>\"\",12/3.412/AI14,IF(IFERROR(SEARCH(\"Heat\",P14,1)>0,FALSE),IF(IFERROR(SEARCH(\"Terminal\",P14,1)>0,FALSE),INDEX(INDIRECT(BS14),A14,3+MATCH(TRM,PTAC!$AC$9:$AE$9,0)),INDEX(INDIRECT(BS14),MATCH(TRM,BaselineRow,0),3)),\"\"))","v":""},"","","",{"$error":"#N/A"},{"$error":"#N/A"},{"$error":"#N/A"},0,{"$error":"#N/A"},{"$error":"#N/A"},{"$error":"#N/A"},{"$error":"#VALUE!"},{"$error":"#N/A"},{"$error":"#N/A"},{"$error":"#N/A"},{"$error":"#VALUE!"},0,0,0,0,{"$f":"INDEX('Utility Admin'!$P$2:$AD$2,1,MATCH($P14,'Utility Admin'!$P$3:$AD$3,0))","v":{"$error":"#N/A"}},{"$f":"INDEX('Utility Admin'!AE$2:AS$2,1,MATCH($P14,'Utility Admin'!$P$3:$AD$3,0))","v":{"$error":"#N/A"}},{"$f":"IF(kWhOverride=\"\",INDEX('Utility Admin'!$AT$2:$BH$2,1,MATCH($P14,'Utility Admin'!$P$3:$AD$3,0)),kWhOverride)","v":{"$error":"#N/A"}},"",{"$f":"INDEX('Equipment Lookups'!$AF$5:$BS$46,MATCH(Inventory!BL14,'Equipment Lookups'!$J$5:$J$46,0),MATCH(Inventory!DE14,'Equipment Lookups'!$AF$4:$BS$4,0))","v":{"$error":"#N/A"}},{"$f":"INDEX('Equipment Lookups'!$AE$5:$AE$46,MATCH(Inventory!BR14,'Equipment Lookups'!$J$5:$J$46,0))","v":{"$error":"#N/A"}},{"$error":"#N/A"},{"$error":"#N/A"},{"$error":"#N/A"},{"$error":"#N/A"},{"$error":"#N/A"},{"$error":"#N/A"},{"$error":"#N/A"},{"$error":"#N/A"},{"$error":"#N/A"},{"$error":"#N/A"},{"$error":"#N/A"},{"$error":"#N/A"},{"$error":"#N/A"},{"$error":"#N/A"},{"$error":"#N/A"},{"$error":"#N/A"},{"$error":"#N/A"},{"$error":"#N/A"},{"$error":"#N/A"},0,0,0]
[8,null,null,null,null,null,null,{"$f":"IFERROR(INDEX(DefaultUnits,MATCH(F15,EquipmentTypes,0),1),\"\")","v":""},null,null,null,null,null,null,null,null,null,{"$f":"IFERROR(INDEX(DefaultUnits,MATCH(P15,EquipmentTypes,0),1),\"\")","v":""},null,"",null,null,"","",null,null,null,null,{"$f":"IFERROR(INDEX(DefaultUnits,MATCH(P15,EquipmentTypes,0),3),\"\")","v":""},null,"",null,null,null,null,null,null,null,null,0,0,0,{"$f":"IFERROR(IF($AR$3<'Utility Admin'!$I$2,AR15,'Utility Admin'!$I$2/Inventory!$AR$3*AR15),0)","v":0},0,{"$f":"IFERROR(ProjectCost-SUM(AS16:AS39),0)","v":0},null,"","","","","",null,0,0,0,"UNITS","",0,{"$f":"IF('Project Info'!$D$7=\"TX\",INDEX(EFLH!$AB$4:$AB$30,MATCH(C15,TX_EFLHSanAntonio[Building Type],0),1),'Project Info'!$D$7&\"EquipmentType\")","v":"EquipmentType"},0,0,{"$f":"IF(IFERROR(SEARCH(\"Terminal\",F15,1)>0,FALSE),\"\",HLOOKUP(BI15,'Equipment Lookups'!$L$4:$AB$46,VLOOKUP(Inventory!BL15,'Equipment Lookups'!$J$5:$K$46,2,FALSE),TRUE))","v":{"$error":"#N/A"}},{"$f":"IF(L15=\"Unknown\",YEAR(TODAY())-INDEX('Equipment Lookups'!$AC$5:$AC$38,MATCH(Inventory!BL15,'Equipment Lookups'!$J$5:$J$38,0)),L15)","v":0},"",{"$error":"#N/A"},0,0,0,{"$f":"IF(IFERROR(SEARCH(\"Terminal\",P15,1)>0,FALSE),\"\",HLOOKUP(BO15,'Equipment Lookups'!$L$4:$AB$46,VLOOKUP(Inventory!BR15,'Equipment Lookups'!$J$5:$K$46,2,FALSE),TRUE))","v":{"$error":"#N/A"}},"",{"$error":"#N/A"},{"$f":"INDEX('Equipment Lookups'!$AD$5:$AD$46,MATCH(Inventory!BR15,'Equipment Lookups'!$J$5:$J$46,0))","v":{"$error":"#N/A"}},{"$f":"IFERROR(IF(AL15<>\"\",AL15,IF(State=\"TX\",INDEX(TX_EFLHSanAntonio[[CFAir Cooled Chiller]:[CFPTRoom]],MATCH(Inventory!C15,TX_EFLHSanAntonio[Building Type],0),MATCH(BT15,EFLH!$N$2:$Q$2,0)),VLOOKUP(C15,INDIRECT($BX$5),4,FALSE))),\"-\")","v":"-"},{"$f":"IFERROR(IF(AJ15<>\"\",AJ15,IF(State=\"TX\",INDEX(TX_EFLHSanAntonio[[EFLHcAir Cooled Chiller]:[EFLHcPTRoom]],MATCH(Inventory!C15,TX_EFLHSanAntonio[Building Type],0),MATCH(BT15,EFLH!$V$2:$Y$2,0)),VLOOKUP(C15,INDIRECT($BX$5),2,FALSE))),\"-\")","v":"-"},{"$f":"IFERROR(IF(AK15<>\"\",AK15,IF(State=\"TX\",INDEX(TX_EFLHSanAntonio[[EFLHhDX]:[EFLHhPTRoom]],MATCH(Inventory!C15,TX_EFLHSanAntonio[Building Type],0),MATCH(BT15,EFLH!$Z$2:$AA$2,0)),VLOOKUP(C15,INDIRECT($BX$5),3,FALSE))),\"-\")","v":"-"},{"$f":"IF(AM15<>\"\",AM15,IF(State=\"TX\",INDEX(TX_EFLHSanAntonio[[NCPAir Cooled Chiller]:[NCPPTRoom]],MATCH(Inventory!C15,TX_EFLHSanAntonio[Building Type],0),MATCH(BT15,EFLH!$R$2:$U$2,0)),0))","v":0},1,{"$error":"#N/A"},{"$error":"#N/A"},"",{"$f":"IF(AG15<>\"\",AG15,IF(IFERROR(SEARCH(\"Terminal\",P15,1)>0,FALSE),INDEX(INDIRECT(BS15),A15,MATCH(TRM,PTAC!$AC$9:$AE$9,0)),INDEX(INDIRECT(BS15),MATCH(TRM,BaselineRow,0),1)))","v":{"$error":"#N/A"}},{"$error":"#N/A"},{"$f":"IF(AI15<>\"\",12/3.412/AI15,IF(IFERROR(SEARCH(\"Heat\",P15,1)>0,FALSE),IF(IFERROR(SEARCH(\"Terminal\",P15,1)>0,FALSE),INDEX(INDIRECT(BS15),A15,3+MATCH(TRM,PTAC!$AC$9:$AE$9,0)),INDEX(INDIRECT(BS15),MATCH(TRM,BaselineRow,0),3)),\"\"))","v":""},{"$f":"IF(AG15<>\"\",AG15,IF(IFERROR(SEARCH(\"Terminal\",P15,1)>0,FALSE),INDEX(INDIRECT(BS15),A15,MATCH(TRM,PTAC!$AC$9:$AE$9,0)),INDEX(INDIRECT(BS15),MATCH(TRM,BaselineRow,0),1)))","v":{"$error":"#N/A"}},{"$error":"#N/A"},{"$f":"IF(AI15<>\"\",12/3.412/AI15,IF(IFERROR(SEARCH(\"Heat\",P15,1)>0,FALSE),IF(IFERROR(SEARCH(\"Terminal\",P15,1)>0,FALSE),INDEX(INDIRECT(BS15),A15,3+MATCH(TRM,PTAC!$AC$9:$AE$9,0)),INDEX(INDIRECT(BS15),MATCH(TRM,BaselineRow,0),3)),\"\"))","v":""},"","","",{"$error":"#N/A"},{"$error":"#N/A"},{"$error":"#N/A"},0,{"$error":"#N/A"},{"$error":"#N/A"},{"$error":"#N/A"},{"$error":"#VALUE!"},{"$error":"#N/A"},{"$error":"#N/A"},{"$error":"#N/A"},{"$error":"#VALUE!"},0,0,0,0,{"$f":"INDEX('Utility Admin'!$P$2:$AD$2,1,MATCH($P15,'Utility Admin'!$P$3:$AD$3,0))","v":{"$error":"#N/A"}},{"$f":"INDEX('Utility Admin'!AE$2:AS$2,1,MATCH($P15,'Utility Admin'!$P$3:$AD$3,0))","v":{"$error":"#N/A"}},{"$f":"IF(kWhOverride=\"\",INDEX('Utility Admin'!$AT$2:$BH$2,1,MATCH($P15,'Utility Admin'!$P$3:$AD$3,0)),kWhOverride)","v":{"$error":"#N/A"}},"",{"$f":"INDEX('Equipment Lookups'!$AF$5:$BS$46,MATCH(Inventory!BL15,'Equipment Lookups'!$J$5:$J$46,0),MATCH(Inventory!DE15,'Equipment Lookups'!$AF$4:$BS$4,0))","v":{"$error":"#N/A"}},{"$f":"INDEX('Equipment Lookups'!$AE$5:$AE$46,MATCH(Inventory!BR15,'Equipment Lookups'!$J$5:$J$46,0))","v":{"$error":"#N/A"}},{"$error":"#N/A"},{"$error":"#N/A"},{"$error":"#N/A"},{"$error":"#N/A"},{"$error":"#N/A"},{"$error":"#N/A"},{"$error":"#N/A"},{"$error":"#N/A"},{"$error":"#N/A"},{"$error":"#N/A"},{"$error":"#N/A"},{"$error":"#N/A"},{"$error":"#N/A"},{"$error":"#N/A"},{"$error":"#N/A"},{"$error":"#N/A"},{"$error":"#N/A"},{"$error":"#N/A"},{"$error":"#N/A"},0,0,0]
[9,null,null,null,null,null,null,{"$f":"IFERROR(INDEX(DefaultUnits,MATCH(F16,EquipmentTypes,0),1),\"\")","v":""},null,null,null,null,null,null,null,null,null,{"$f":"IFERROR(INDEX(DefaultUnits,MATCH(P16,EquipmentTypes,0),1),\"\")","v":""},null,"",null,null,"","",null,null,null,null,{"$f":"IFERROR(INDEX(DefaultUnits,MATCH(P16,EquipmentTypes,0),3),\"\")","v":""},null,"",null,null,null,null,null,null,null,null,0,0,0,{"$f":"IFERROR(IF($AR$3<'Utility Admin'!$I$2,AR16,'Utility Admin'!$I$2/Inventory!$AR$3*AR16),0)","v":0},0,{"$f":"IFERROR(ProjectCost-SUM(AS17:AS40),0)","v":0},null,"","","","","",null,0,0,0,"UNITS","",0,{"$f":"IF('Project Info'!$D$7=\"TX\",INDEX(EFLH!$AB$4:$AB$30,MATCH(C16,TX_EFLHSanAntonio[Building Type],0),1),'Project Info'!$D$7&\"EquipmentType\")","v":"EquipmentType"},0,0,{"$f":"IF(IFERROR(SEARCH(\"Terminal\",F16,1)>0,FALSE),\"\",HLOOKUP(BI16,'Equipment Lookups'!$L$4:$AB$46,VLOOKUP(Inventory!BL16,'Equipment Lookups'!$J$5:$K$46,2,FALSE),TRUE))","v":{"$error":"#N/A"}},{"$f":"IF(L16=\"Unknown\",YEAR(TODAY())-INDEX('Equipment Lookups'!$AC$5:$AC$38,MATCH(Inventory!BL16,'Equipment Lookups'!$J$5:$J$38,0)),L16)","v":0},"",{"$error":"#N/A"},0,0,0,{"$f":"IF(IFERROR(SEARCH(\"Terminal\",P16,1)>0,FALSE),\"\",HLOOKUP(BO16,'Equipment Lookups'!$L$4:$AB$46,VLOOKUP(Inventory!BR16,'Equipment Lookups'!$J$5:$K$46,2,FALSE),TRUE))","v":{"$error":"#N/A"}},"",{"$error":"#N/A"},{"$f":"INDEX('Equipment Lookups'!$AD$5:$AD$46,MATCH(Inventory!BR16,'Equipment Lookups'!$J$5:$J$46,0))","v":{"$error":"#N/A"}},{"$f":"IFERROR(IF(AL16<>\"\",AL16,IF(State=\"TX\",INDEX(TX_EFLHSanAntonio[[CFAir Cooled Chiller]:[CFPTRoom]],MATCH(Inventory!C16,TX_EFLHSanAntonio[Building Type],0),MATCH(BT16,EFLH!$N$2:$Q$2,0)),VLOOKUP(C16,INDIRECT($BX$5),4,FALSE))),\"-\")","v":"-"},{"$f":"IFERROR(IF(AJ16<>\"\",AJ16,IF(State=\"TX\",INDEX(TX_EFLHSanAntonio[[EFLHcAir Cooled Chiller]:[EFLHcPTRoom]],MATCH(Inventory!C16,TX_EFLHSanAntonio[Building Type],0),MATCH(BT16,EFLH!$V$2:$Y$2,0)),VLOOKUP(C16,INDIRECT($BX$5),2,FALSE))),\"-\")","v":"-"},{"$f":"IFERROR(IF(AK16<>\"\",AK16,IF(State=\"TX\",INDEX(TX_EFLHSanAntonio[[EFLHhDX]:[EFLHhPTRoom]],MATCH(Inventory!C16,TX_EFLHSanAntonio[Building Type],0),MATCH(BT16,EFLH!$Z$2:$AA$2,0)),VLOOKUP(C16,INDIRECT($BX$5),3,FALSE))),\"-\")","v":"-"},{"$f":"IF(AM16<>\"\",AM16,IF(State=\"TX\",INDEX(TX_EFLHSanAntonio[[NCPAir Cooled Chiller]:[NCPPTRoom]],MATCH(Inventory!C16,TX_EFLHSanAntonio[Building Type],0),MATCH(BT16,EFLH!$R$2:$U$2,0)),0))","v":0},1,{"$error":"#N/A"},{"$error":"#N/A"},"",{"$f":"IF(AG16<>\"\",AG16,IF(IFERROR(SEARCH(\"Terminal\",P16,1)>0,FALSE),INDEX(INDIRECT(BS16),A16,MATCH(TRM,PTAC!$AC$9:$AE$9,0)),INDEX(INDIRECT(BS16),MATCH(TRM,BaselineRow,0),1)))","v":{"$error":"#N/A"}},{"$error":"#N/A"},{"$f":"IF(AI16<>\"\",12/3.412/AI16,IF(IFERROR(SEARCH(\"Heat\",P16,1)>0,FALSE),IF(IFERROR(SEARCH(\"Terminal\",P16,1)>0,FALSE),INDEX(INDIRECT(BS16),A16,3+MATCH(TRM,PTAC!$AC$9:$AE$9,0)),INDEX(INDIRECT(BS16),MATCH(TRM,BaselineRow,0),3)),\"\"))","v":""},{"$f":"IF(AG16<>\"\",AG16,IF(IFERROR(SEARCH(\"Terminal\",P16,1)>0,FALSE),INDEX(INDIRECT(BS16),A16,MATCH(TRM,PTAC!$AC$9:$AE$9,0)),INDEX(INDIRECT(BS16),MATCH(TRM,BaselineRow,0),1)))","v":{"$error":"#N/A"}},{"$error":"#N/A"},{"$f":"IF(AI16<>\"\",12/3.412/AI16,IF(IFERROR(SEARCH(\"Heat\",P16,1)>0,FALSE),IF(IFERROR(SEARCH(\"Terminal\",P16,1)>0,FALSE),INDEX(INDIRECT(BS16),A16,3+MATCH(TRM,PTAC!$AC$9:$AE$9,0)),INDEX(INDIRECT(BS16),MATCH(TRM,BaselineRow,0),3)),\"\"))","v":""},"","","",{"$error":"#N/A"},{"$error":"#N/A"},{"$error":"#N/A"},0,{"$error":"#N/A"},{"$error":"#N/A"},{"$error":"#N/A"},{"$error":"#VALUE!"},{"$error":"#N/A"},{"$error":"#N/A"},{"$error":"#N/A"},{"$error":"#VALUE!"},0,0,0,0,{"$f":"INDEX('Utility Admin'!$P$2:$AD$2,1,MATCH($P16,'Utility Admin'!$P$3:$AD$3,0))","v":{"$error":"#N/A"}},{"$f":"INDEX('Utility Admin'!AE$2:AS$2,1,MATCH($P16,'Utility Admin'!$P$3:$AD$3,0))","v":{"$error":"#N/A"}},{"$f":"IF(kWhOverride=\"\",INDEX('Utility Admin'!$AT$2:$BH$2,1,MATCH($P16,'Utility Admin'!$P$3:$AD$3,0)),kWhOverride)","v":{"$error":"#N/A"}},"",{"$f":"INDEX('Equipment Lookups'!$AF$5:$BS$46,MATCH(Inventory!BL16,'Equipment Lookups'!$J$5:$J$46,0),MATCH(Inventory!DE16,'Equipment Lookups'!$AF$4:$BS$4,0))","v":{"$error":"#N/A"}},{"$f":"INDEX('Equipment Lookups'!$AE$5:$AE$46,MATCH(Inventory!BR16,'Equipment Lookups'!$J$5:$J$46,0))","v":{"$error":"#N/A"}},{"$error":"#N/A"},{"$error":"#N/A"},{"$error":"#N/A"},{"$error":"#N/A"},{"$error":"#N/A"},{"$error":"#N/A"},{"$error":"#N/A"},{"$error":"#N/A"},{"$error":"#N/A"},{"$error":"#N/A"},{"$error":"#N/A"},{"$error":"#N/A"},{"$error":"#N/A"},{"$error":"#N/A"},{"$error":"#N/A"},{"$error":"#N/A"},{"$error":"#N/A"},{"$error":"#N/A"},{"$error":"#N/A"},0,0,0]
[10,null,null,null,null,null,null,{"$f":"IFERROR(INDEX(DefaultUnits,MATCH(F17,EquipmentTypes,0),1),\"\")","v":""},null,null,null,null,null,null,null,null,null,{"$f":"IFERROR(INDEX(DefaultUnits,MATCH(P17,EquipmentTypes,0),1),\"\")","v":""},null,"",null,null,"","",null,null,null,null,{"$f":"IFERROR(INDEX(DefaultUnits,MATCH(P17,EquipmentTypes,0),3),\"\")","v":""},null,"",null,null,null,null,null,null,null,null,0,0,0,{"$f":"IFERROR(IF($AR$3<'Utility Admin'!$I$2,AR17,'Utility Admin'!$I$2/Inventory!$AR$3*AR17),0)","v":0},0,{"$f":"IFERROR(ProjectCost-SUM(AS18:AS41),0)","v":0},null,"","","","","",null,0,0,0,"UNITS","",0,{"$f":"IF('Project Info'!$D$7=\"TX\",INDEX(EFLH!$AB$4:$AB$30,MATCH(C17,TX_EFLHSanAntonio[Building Type],0),1),'Project Info'!$D$7&\"EquipmentType\")","v":"EquipmentType"},0,0,{"$f":"IF(IFERROR(SEARCH(\"Terminal\",F17,1)>0,FALSE),\"\",HLOOKUP(BI17,'Equipment Lookups'!$L$4:$AB$46,VLOOKUP(Inventory!BL17,'Equipment Lookups'!$J$5:$K$46,2,FALSE),TRUE))","v":{"$error":"#N/A"}},{"$f":"IF(L17=\"Unknown\",YEAR(TODAY())-INDEX('Equipment Lookups'!$AC$5:$AC$38,MATCH(Inventory!BL17,'Equipment Lookups'!$J$5:$J$38,0)),L17)","v":0},"",{"$error":"#N/A"},0,0,0,{"$f":"IF(IFERROR(SEARCH(\"Terminal\",P17,1)>0,FALSE),\"\",HLOOKUP(BO17,'Equipment Lookups'!$L$4:$AB$46,VLOOKUP(Inventory!BR17,'Equipment Lookups'!$J$5:$K$46,2,FALSE),TRUE))","v":{"$error":"#N/A"}},"",{"$error":"#N/A"},{"$f":"INDEX('Equipment Lookups'!$AD$5:$AD$46,MATCH(Inventory!BR17,'Equipment Lookups'!$J$5:$J$46,0))","v":{"$error":"#N/A"}},{"$f":"IFERROR(IF(AL17<>\"\",AL17,IF(State=\"TX\",INDEX(TX_EFLHSanAntonio[[CFAir Cooled Chiller]:[CFPTRoom]],MATCH(Inventory!C17,TX_EFLHSanAntonio[Building Type],0),MATCH(BT17,EFLH!$N$2:$Q$2,0)),VLOOKUP(C17,INDIRECT($BX$5),4,FALSE))),\"-\")","v":"-"},{"$f":"IFERROR(IF(AJ17<>\"\",AJ17,IF(State=\"TX\",INDEX(TX_EFLHSanAntonio[[EFLHcAir Cooled Chiller]:[EFLHcPTRoom]],MATCH(Inventory!C17,TX_EFLHSanAntonio[Building Type],0),MATCH(BT17,EFLH!$V$2:$Y$2,0)),VLOOKUP(C17,INDIRECT($BX$5),2,FALSE))),\"-\")","v":"-"},{"$f":"IFERROR(IF(AK17<>\"\",AK17,IF(State=\"TX\",INDEX(TX_EFLHSanAntonio[[EFLHhDX]:[EFLHhPTRoom]],MATCH(Inventory!C17,TX_EFLHSanAntonio[Building Type],0),MATCH(BT17,EFLH!$Z$2:$AA$2,0)),VLOOKUP(C17,INDIRECT($BX$5),3,FALSE))),\"-\")","v":"-"},{"$f":"IF(AM17<>\"\",AM17,IF(State=\"TX\",INDEX(TX_EFLHSanAntonio[[NCPAir Cooled Chiller]:[NCPPTRoom]],MATCH(Inventory!C17,TX_EFLHSanAntonio[Building Type],0),MATCH(BT17,EFLH!$R$2:$U$2,0)),0))","v":0},1,{"$error":"#N/A"},{"$error":"#N/A"},"",{"$f":"IF(AG17<>\"\",AG17,IF(IFERROR(SEARCH(\"Terminal\",P17,1)>0,FALSE),INDEX(INDIRECT(BS17),A17,MATCH(TRM,PTAC!$AC$9:$AE$9,0)),INDEX(INDIRECT(BS17),MATCH(TRM,BaselineRow,0),1)))","v":{"$error":"#N/A"}},{"$error":"#N/A"},{"$f":"IF(AI17<>\"\",12/3.412/AI17,IF(IFERROR(SEARCH(\"Heat\",P17,1)>0,FALSE),IF(IFERROR(SEARCH(\"Terminal\",P17,1)>0,FALSE),INDEX(INDIRECT(BS17),A17,3+MATCH(TRM,PTAC!$AC$9:$AE$9,0)),INDEX(INDIRECT(BS17),MATCH(TRM,BaselineRow,0),3)),\"\"))","v":""},{"$f":"IF(AG17<>\"\",AG17,IF(IFERROR(SEARCH(\"Terminal\",P17,1)>0,FALSE),INDEX(INDIRECT(BS17),A17,MATCH(TRM,PTAC!$AC$9:$AE$9,0)),INDEX(INDIRECT(BS17),MATCH(TRM,BaselineRow,0),1)))","v":{"$error":"#N/A"}},{"$error":"#N/A"},{"$f":"IF(AI17<>\"\",12/3.412/AI17,IF(IFERROR(SEARCH(\"Heat\",P17,1)>0,FALSE),IF(IFERROR(SEARCH(\"Terminal\",P17,1)>0,FALSE),INDEX(INDIRECT(BS17),A17,3+MATCH(TRM,PTAC!$AC$9:$AE$9,0)),INDEX(INDIRECT(BS17),MATCH(TRM,BaselineRow,0),3)),\"\"))","v":""},"","","",{"$error":"#N/A"},{"$error":"#N/A"},{"$error":"#N/A"},0,{"$error":"#N/A"},{"$error":"#N/A"},{"$error":"#N/A"},{"$error":"#VALUE!"},{"$error":"#N/A"},{"$error":"#N/A"},{"$error":"#N/A"},{"$error":"#VALUE!"},0,0,0,0,{"$f":"INDEX('Utility Admin'!$P$2:$AD$2,1,MATCH($P17,'Utility Admin'!$P$3:$AD$3,0))","v":{"$error":"#N/A"}},{"$f":"INDEX('Utility Admin'!AE$2:AS$2,1,MATCH($P17,'Utility Admin'!$P$3:$AD$3,0))","v":{"$error":"#N/A"}},{"$f":"IF(kWhOverride=\"\",INDEX('Utility Admin'!$AT$2:$BH$2,1,MATCH($P17,'Utility Admin'!$P$3:$AD$3,0)),kWhOverride)","v":{"$error":"#N/A"}},"",{"$f":"INDEX('Equipment Lookups'!$AF$5:$BS$46,MATCH(Inventory!BL17,'Equipment Lookups'!$J$5:$J$46,0),MATCH(Inventory!DE17,'Equipment Lookups'!$AF$4:$BS$4,0))","v":{"$error":"#N/A"}},{"$f":"INDEX('Equipment Lookups'!$AE$5:$AE$46,MATCH(Inventory!BR17,'Equipment Lookups'!$J$5:$J$46,0))","v":{"$error":"#N/A"}},{"$error":"#N/A"},{"$error":"#N/A"},{"$error":"#N/A"},{"$error":"#N/A"},{"$error":"#N/A"},{"$error":"#N/A"},{"$error":"#N/A"},{"$error":"#N/A"},{"$error":"#N/A"},{"$error":"#N/A"},{"$error":"#N/A"},{"$error":"#N/A"},{"$error":"#N/A"},{"$error":"#N/A"},{"$error":"#N/A"},{"$error":"#N/A"},{"$error":"#N/A"},{"$error":"#N/A"},{"$error":"#N/A"},0,0,0]
[11,null,null,null,null,null,null,{"$f":"IFERROR(INDEX(DefaultUnits,MATCH(F18,EquipmentTypes,0),1),\"\")","v":""},null,null,null,null,null,null,null,null,null,{"$f":"IFERROR(INDEX(DefaultUnits,MATCH(P18,EquipmentTypes,0),1),\"\")","v":""},null,"",null,null,"","",null,null,null,null,{"$f":"IFERROR(INDEX(DefaultUnits,MATCH(P18,EquipmentTypes,0),3),\"\")","v":""},null,"",null,null,null,null,null,null,null,null,0,0,0,{"$f":"IFERROR(IF($AR$3<'Utility Admin'!$I$2,AR18,'Utility Admin'!$I$2/Inventory!$AR$3*AR18),0)","v":0},0,{"$f":"IFERROR(ProjectCost-SUM(AS19:AS42),0)","v":0},null,"","","","","",null,0,0,0,"UNITS","",0,{"$f":"IF('Project Info'!$D$7=\"TX\",INDEX(EFLH!$AB$4:$AB$30,MATCH(C18,TX_EFLHSanAntonio[Building Type],0),1),'Project Info'!$D$7&\"EquipmentType\")","v":"EquipmentType"},0,0,{"$f":"IF(IFERROR(SEARCH(\"Terminal\",F18,1)>0,FALSE),\"\",HLOOKUP(BI18,'Equipment Lookups'!$L$4:$AB$46,VLOOKUP(Inventory!BL18,'Equipment Lookups'!$J$5:$K$46,2,FALSE),TRUE))","v":{"$error":"#N/A"}},{"$f":"IF(L18=\"Unknown\",YEAR(TODAY())-INDEX('Equipment Lookups'!$AC$5:$AC$38,MATCH(Inventory!BL18,'Equipment Lookups'!$J$5:$J$38,0)),L18)","v":0},"",{"$error":"#N/A"},0,0,0,{"$f":"IF(IFERROR(SEARCH(\"Terminal\",P18,1)>0,FALSE),\"\",HLOOKUP(BO18,'Equipment Lookups'!$L$4:$AB$46,VLOOKUP(Inventory!BR18,'Equipment Lookups'!$J$5:$K$46,2,FALSE),TRUE))","v":{"$error":"#N/A"}},"",{"$error":"#N/A"},{"$f":"INDEX('Equipment Lookups'!$AD$5:$AD$46,MATCH(Inventory!BR18,'Equipment Lookups'!$J$5:$J$46,0))","v":{"$error":"#N/A"}},{"$f":"IFERROR(IF(AL18<>\"\",AL18,IF(State=\"TX\",INDEX(TX_EFLHSanAntonio[[CFAir Cooled Chiller]:[CFPTRoom]],MATCH(Inventory!C18,TX_EFLHSanAntonio[Building Type],0),MATCH(BT18,EFLH!$N$2:$Q$2,0)),VLOOKUP(C18,INDIRECT($BX$5),4,FALSE))),\"-\")","v":"-"},{"$f":"IFERROR(IF(AJ18<>\"\",AJ18,IF(State=\"TX\",INDEX(TX_EFLHSanAntonio[[EFLHcAir Cooled Chiller]:[EFLHcPTRoom]],MATCH(Inventory!C18,TX_EFLHSanAntonio[Building Type],0),MATCH(BT18,EFLH!$V$2:$Y$2,0)),VLOOKUP(C18,INDIRECT($BX$5),2,FALSE))),\"-\")","v":"-"},{"$f":"IFERROR(IF(AK18<>\"\",AK18,IF(State=\"TX\",INDEX(TX_EFLHSanAntonio[[EFLHhDX]:[EFLHhPTRoom]],MATCH(Inventory!C18,TX_EFLHSanAntonio[Building Type],0),MATCH(BT18,EFLH!$Z$2:$AA$2,0)),VLOOKUP(C18,INDIRECT($BX$5),3,FALSE))),\"-\")","v":"-"},{"$f":"IF(AM18<>\"\",AM18,IF(State=\"TX\",INDEX(TX_EFLHSanAntonio[[NCPAir Cooled Chiller]:[NCPPTRoom]],MATCH(Inventory!C18,TX_EFLHSanAntonio[Building Type],0),MATCH(BT18,EFLH!$R$2:$U$2,0)),0))","v":0},1,{"$error":"#N/A"},{"$error":"#N/A"},"",{"$f":"IF(AG18<>\"\",AG18,IF(IFERROR(SEARCH(\"Terminal\",P18,1)>0,FALSE),INDEX(INDIRECT(BS18),A18,MATCH(TRM,PTAC!$AC$9:$AE$9,0)),INDEX(INDIRECT(BS18),MATCH(TRM,BaselineRow,0),1)))","v":{"$error":"#N/A"}},{"$error":"#N/A"},{"$f":"IF(AI18<>\"\",12/3.412/AI18,IF(IFERROR(SEARCH(\"Heat\",P18,1)>0,FALSE),IF(IFERROR(SEARCH(\"Terminal\",P18,1)>0,FALSE),INDEX(INDIRECT(BS18),A18,3+MATCH(TRM,PTAC!$AC$9:$AE$9,0)),INDEX(INDIRECT(BS18),MATCH(TRM,BaselineRow,0),3)),\"\"))","v":""},{"$f":"IF(AG18<>\"\",AG18,IF(IFERROR(SEARCH(\"Terminal\",P18,1)>0,FALSE),INDEX(INDIRECT(BS18),A18,MATCH(TRM,PTAC!$AC$9:$AE$9,0)),INDEX(INDIRECT(BS18),MATCH(TRM,BaselineRow,0),1)))","v":{"$error":"#N/A"}},{"$error":"#N/A"},{"$f":"IF(AI18<>\"\",12/3.412/AI18,IF(IFERROR(SEARCH(\"Heat\",P18,1)>0,FALSE),IF(IFERROR(SEARCH(\"Terminal\",P18,1)>0,FALSE),INDEX(INDIRECT(BS18),A18,3+MATCH(TRM,PTAC!$AC$9:$AE$9,0)),INDEX(INDIRECT(BS18),MATCH(TRM,BaselineRow,0),3)),\"\"))","v":""},"","","",{"$error":"#N/A"},{"$error":"#N/A"},{"$error":"#N/A"},0,{"$error":"#N/A"},{"$error":"#N/A"},{"$error":"#N/A"},{"$error":"#VALUE!"},{"$error":"#N/A"},{"$error":"#N/A"},{"$error":"#N/A"},{"$error":"#VALUE!"},0,0,0,0,{"$f":"INDEX('Utility Admin'!$P$2:$AD$2,1,MATCH($P18,'Utility Admin'!$P$3:$AD$3,0))","v":{"$error":"#N/A"}},{"$f":"INDEX('Utility Admin'!AE$2:AS$2,1,MATCH($P18,'Utility Admin'!$P$3:$AD$3,0))","v":{"$error":"#N/A"}},{"$f":"IF(kWhOverride=\"\",INDEX('Utility Admin'!$AT$2:$BH$2,1,MATCH($P18,'Utility Admin'!$P$3:$AD$3,0)),kWhOverride)","v":{"$error":"#N/A"}},"",{"$f":"INDEX('Equipment Lookups'!$AF$5:$BS$46,MATCH(Inventory!BL18,'Equipment Lookups'!$J$5:$J$46,0),MATCH(Inventory!DE18,'Equipment Lookups'!$AF$4:$BS$4,0))","v":{"$error":"#N/A"}},{"$f":"INDEX('Equipment Lookups'!$AE$5:$AE$46,MATCH(Inventory!BR18,'Equipment Lookups'!$J$5:$J$46,0))","v":{"$error":"#N/A"}},{"$error":"#N/A"},{"$error":"#N/A"},{"$error":"#N/A"},{"$error":"#N/A"},{"$error":"#N/A"},{"$error":"#N/A"},{"$error":"#N/A"},{"$error":"#N/A"},{"$error":"#N/A"},{"$error":"#N/A"},{"$error":"#N/A"},{"$error":"#N/A"},{"$error":"#N/A"},{"$error":"#N/A"},{"$error":"#N/A"},{"$error":"#N/A"},{"$error":"#N/A"},{"$error":"#N/A"},{"$error":"#N/A"},0,0,0]
[12,null,null,null,null,null,null,{"$f":"IFERROR(INDEX(DefaultUnits,MATCH(F19,EquipmentTypes,0),1),\"\")","v":""},null,null,null,null,null,null,null,null,null,{"$f":"IFERROR(INDEX(DefaultUnits,MATCH(P19,EquipmentTypes,0),1),\"\")","v":""},null,"",null,null,"","",null,null,null,null,{"$f":"IFERROR(INDEX(DefaultUnits,MATCH(P19,EquipmentTypes,0),3),\"\")","v":""},null,"",null,null,null,null,null,null,null,null,0,0,0,{"$f":"IFERROR(IF($AR$3<'Utility Admin'!$I$2,AR19,'Utility Admin'!$I$2/Inventory!$AR$3*AR19),0)","v":0},0,{"$f":"IFERROR(ProjectCost-SUM(AS20:AS43),0)","v":0},null,"","","","","",null,0,0,0,"UNITS","",0,{"$f":"IF('Project Info'!$D$7=\"TX\",INDEX(EFLH!$AB$4:$AB$30,MATCH(C19,TX_EFLHSanAntonio[Building Type],0),1),'Project Info'!$D$7&\"EquipmentType\")","v":"EquipmentType"},0,0,{"$f":"IF(IFERROR(SEARCH(\"Terminal\",F19,1)>0,FALSE),\"\",HLOOKUP(BI19,'Equipment Lookups'!$L$4:$AB$46,VLOOKUP(Inventory!BL19,'Equipment Lookups'!$J$5:$K$46,2,FALSE),TRUE))","v":{"$error":"#N/A"}},{"$f":"IF(L19=\"Unknown\",YEAR(TODAY())-INDEX('Equipment Lookups'!$AC$5:$AC$38,MATCH(Inventory!BL19,'Equipment Lookups'!$J$5:$J$38,0)),L19)","v":0},"",{"$error":"#N/A"},0,0,0,{"$f":"IF(IFERROR(SEARCH(\"Terminal\",P19,1)>0,FALSE),\"\",HLOOKUP(BO19,'Equipment Lookups'!$L$4:$AB$46,VLOOKUP(Inventory!BR19,'Equipment Lookups'!$J$5:$K$46,2,FALSE),TRUE))","v":{"$error":"#N/A"}},"",{"$error":"#N/A"},{"$f":"INDEX('Equipment Lookups'!$AD$5:$AD$46,MATCH(Inventory!BR19,'Equipment Lookups'!$J$5:$J$46,0))","v":{"$error":"#N/A"}},{"$f":"IFERROR(IF(AL19<>\"\",AL19,IF(State=\"TX\",INDEX(TX_EFLHSanAntonio[[CFAir Cooled Chiller]:[CFPTRoom]],MATCH(Inventory!C19,TX_EFLHSanAntonio[Building Type],0),MATCH(BT19,EFLH!$N$2:$Q$2,0)),VLOOKUP(C19,INDIRECT($BX$5),4,FALSE))),\"-\")","v":"-"},{"$f":"IFERROR(IF(AJ19<>\"\",AJ19,IF(State=\"TX\",INDEX(TX_EFLHSanAntonio[[EFLHcAir Cooled Chiller]:[EFLHcPTRoom]],MATCH(Inventory!C19,TX_EFLHSanAntonio[Building Type],0),MATCH(BT19,EFLH!$V$2:$Y$2,0)),VLOOKUP(C19,INDIRECT($BX$5),2,FALSE))),\"-\")","v":"-"},{"$f":"IFERROR(IF(AK19<>\"\",AK19,IF(State=\"TX\",INDEX(TX_EFLHSanAntonio[[EFLHhDX]:[EFLHhPTRoom]],MATCH(Inventory!C19,TX_EFLHSanAntonio[Building Type],0),MATCH(BT19,EFLH!$Z$2:$AA$2,0)),VLOOKUP(C19,INDIRECT($BX$5),3,FALSE))),\"-\")","v":"-"},{"$f":"IF(AM19<>\"\",AM19,IF(State=\"TX\",INDEX(TX_EFLHSanAntonio[[NCPAir Cooled Chiller]:[NCPPTRoom]],MATCH(Inventory!C19,TX_EFLHSanAntonio[Building Type],0),MATCH(BT19,EFLH!$R$2:$U$2,0)),0))","v":0},1,{"$error":"#N/A"},{"$error":"#N/A"},"",{"$f":"IF(AG19<>\"\",AG19,IF(IFERROR(SEARCH(\"Terminal\",P19,1)>0,FALSE),INDEX(INDIRECT(BS19),A19,MATCH(TRM,PTAC!$AC$9:$AE$9,0)),INDEX(INDIRECT(BS19),MATCH(TRM,BaselineRow,0),1)))","v":{"$error":"#N/A"}},{"$error":"#N/A"},{"$f":"IF(AI19<>\"\",12/3.412/AI19,IF(IFERROR(SEARCH(\"Heat\",P19,1)>0,FALSE),IF(IFERROR(SEARCH(\"Terminal\",P19,1)>0,FALSE),INDEX(INDIRECT(BS19),A19,3+MATCH(TRM,PTAC!$AC$9:$AE$9,0)),INDEX(INDIRECT(BS19),MATCH(TRM,BaselineRow,0),3)),\"\"))","v":""},{"$f":"IF(AG19<>\"\",AG19,IF(IFERROR(SEARCH(\"Terminal\",P19,1)>0,FALSE),INDEX(INDIRECT(BS19),A19,MATCH(TRM,PTAC!$AC$9:$AE$9,0)),INDEX(INDIRECT(BS19),MATCH(TRM,BaselineRow,0),1)))","v":{"$error":"#N/A"}},{"$error":"#N/A"},{"$f":"IF(AI19<>\"\",12/3.412/AI19,IF(IFERROR(SEARCH(\"Heat\",P19,1)>0,FALSE),IF(IFERROR(SEARCH(\"Terminal\",P19,1)>0,FALSE),INDEX(INDIRECT(BS19),A19,3+MATCH(TRM,PTAC!$AC$9:$AE$9,0)),INDEX(INDIRECT(BS19),MATCH(TRM,BaselineRow,0),3)),\"\"))","v":""},"","","",{"$error":"#N/A"},{"$error":"#N/A"},{"$error":"#N/A"},0,{"$error":"#N/A"},{"$error":"#N/A"},{"$error":"#N/A"},{"$error":"#VALUE!"},{"$error":"#N/A"},{"$error":"#N/A"},{"$error":"#N/A"},{"$error":"#VALUE!"},0,0,0,0,{"$f":"INDEX('Utility Admin'!$P$2:$AD$2,1,MATCH($P19,'Utility Admin'!$P$3:$AD$3,0))","v":{"$error":"#N/A"}},{"$f":"INDEX('Utility Admin'!AE$2:AS$2,1,MATCH($P19,'Utility Admin'!$P$3:$AD$3,0))","v":{"$error":"#N/A"}},{"$f":"IF(kWhOverride=\"\",INDEX('Utility Admin'!$AT$2:$BH$2,1,MATCH($P19,'Utility Admin'!$P$3:$AD$3,0)),kWhOverride)","v":{"$error":"#N/A"}},"",{"$f":"INDEX('Equipment Lookups'!$AF$5:$BS$46,MATCH(Inventory!BL19,'Equipment Lookups'!$J$5:$J$46,0),MATCH(Inventory!DE19,'Equipment Lookups'!$AF$4:$BS$4,0))","v":{"$error":"#N/A"}},{"$f":"INDEX('Equipment Lookups'!$AE$5:$AE$46,MATCH(Inventory!BR19,'Equipment Lookups'!$J$5:$J$46,0))","v":{"$error":"#N/A"}},{"$error":"#N/A"},{"$error":"#N/A"},{"$error":"#N/A"},{"$error":"#N/A"},{"$error":"#N/A"},{"$error":"#N/A"},{"$error":"#N/A"},{"$error":"#N/A"},{"$error":"#N/A"},{"$error":"#N/A"},{"$error":"#N/A"},{"$error":"#N/A"},{"$error":"#N/A"},{"$error":"#N/A"},{"$error":"#N/A"},{"$error":"#N/A"},{"$error":"#N/A"},{"$error":"#N/A"},{"$error":"#N/A"},0,0,0]
[13,null,null,null,null,null,null,{"$f":"IFERROR(INDEX(DefaultUnits,MATCH(F20,EquipmentTypes,0),1),\"\")","v":""},null,null,null,null,null,null,null,null,null,{"$f":"IFERROR(INDEX(DefaultUnits,MATCH(P20,EquipmentTypes,0),1),\"\")","v":""},null,"",null,null,"","",null,null,null,null,{"$f":"IFERROR(INDEX(DefaultUnits,MATCH(P20,EquipmentTypes,0),3),\"\")","v":""},null,"",null,null,null,null,null,null,null,null,0,0,0,{"$f":"IFERROR(IF($AR$3<'Utility Admin'!$I$2,AR20,'Utility Admin'!$I$2/Inventory!$AR$3*AR20),0)","v":0},0,{"$f":"IFERROR(ProjectCost-SUM(AS21:AS44),0)","v":0},null,"","","","","",null,0,0,0,"UNITS","",0,{"$f":"IF('Project Info'!$D$7=\"TX\",INDEX(EFLH!$AB$4:$AB$30,MATCH(C20,TX_EFLHSanAntonio[Building Type],0),1),'Project Info'!$D$7&\"EquipmentType\")","v":"EquipmentType"},0,0,{"$f":"IF(IFERROR(SEARCH(\"Terminal\",F20,1)>0,FALSE),\"\",HLOOKUP(BI20,'Equipment Lookups'!$L$4:$AB$46,VLOOKUP(Inventory!BL20,'Equipment Lookups'!$J$5:$K$46,2,FALSE),TRUE))","v":{"$error":"#N/A"}},{"$f":"IF(L20=\"Unknown\",YEAR(TODAY())-INDEX('Equipment Lookups'!$AC$5:$AC$38,MATCH(Inventory!BL20,'Equipment Lookups'!$J$5:$J$38,0)),L20)","v":0},"",{"$error":"#N/A"},0,0,0,{"$f":"IF(IFERROR(SEARCH(\"Terminal\",P20,1)>0,FALSE),\"\",HLOOKUP(BO20,'Equipment Lookups'!$L$4:$AB$46,VLOOKUP(Inventory!BR20,'Equipment Lookups'!$J$5:$K$46,2,FALSE),TRUE))","v":{"$error":"#N/A"}},"",{"$error":"#N/A"},{"$f":"INDEX('Equipment Lookups'!$AD$5:$AD$46,MATCH(Inventory!BR20,'Equipment Lookups'!$J$5:$J$46,0))","v":{"$error":"#N/A"}},{"$f":"IFERROR(IF(AL20<>\"\",AL20,IF(State=\"TX\",INDEX(TX_EFLHSanAntonio[[CFAir Cooled Chiller]:[CFPTRoom]],MATCH(Inventory!C20,TX_EFLHSanAntonio[Building Type],0),MATCH(BT20,EFLH!$N$2:$Q$2,0)),VLOOKUP(C20,INDIRECT($BX$5),4,FALSE))),\"-\")","v":"-"},{"$f":"IFERROR(IF(AJ20<>\"\",AJ20,IF(State=\"TX\",INDEX(TX_EFLHSanAntonio[[EFLHcAir Cooled Chiller]:[EFLHcPTRoom]],MATCH(Inventory!C20,TX_EFLHSanAntonio[Building Type],0),MATCH(BT20,EFLH!$V$2:$Y$2,0)),VLOOKUP(C20,INDIRECT($BX$5),2,FALSE))),\"-\")","v":"-"},{"$f":"IFERROR(IF(AK20<>\"\",AK20,IF(State=\"TX\",INDEX(TX_EFLHSanAntonio[[EFLHhDX]:[EFLHhPTRoom]],MATCH(Inventory!C20,TX_EFLHSanAntonio[Building Type],0),MATCH(BT20,EFLH!$Z$2:$AA$2,0)),VLOOKUP(C20,INDIRECT($BX$5),3,FALSE))),\"-\")","v":"-"},{"$f":"IF(AM20<>\"\",AM20,IF(State=\"TX\",INDEX(TX_EFLHSanAntonio[[NCPAir Cooled Chiller]:[NCPPTRoom]],MATCH(Inventory!C20,TX_EFLHSanAntonio[Building Type],0),MATCH(BT20,EFLH!$R$2:$U$2,0)),0))","v":0},1,{"$error":"#N/A"},{"$error":"#N/A"},"",{"$f":"IF(AG20<>\"\",AG20,IF(IFERROR(SEARCH(\"Terminal\",P20,1)>0,FALSE),INDEX(INDIRECT(BS20),A20,MATCH(TRM,PTAC!$AC$9:$AE$9,0)),INDEX(INDIRECT(BS20),MATCH(TRM,BaselineRow,0),1)))","v":{"$error":"#N/A"}},{"$error":"#N/A"},{"$f":"IF(AI20<>\"\",12/3.412/AI20,IF(IFERROR(SEARCH(\"Heat\",P20,1)>0,FALSE),IF(IFERROR(SEARCH(\"Terminal\",P20,1)>0,FALSE),INDEX(INDIRECT(BS20),A20,3+MATCH(TRM,PTAC!$AC$9:$AE$9,0)),INDEX(INDIRECT(BS20),MATCH(TRM,BaselineRow,0),3)),\"\"))","v":""},{"$f":"IF(AG20<>\"\",AG20,IF(IFERROR(SEARCH(\"Terminal\",P20,1)>0,FALSE),INDEX(INDIRECT(BS20),A20,MATCH(TRM,PTAC!$AC$9:$AE$9,0)),INDEX(INDIRECT(BS20),MATCH(TRM,BaselineRow,0),1)))","v":{"$error":"#N/A"}},{"$error":"#N/A"},{"$f":"IF(AI20<>\"\",12/3.412/AI20,IF(IFERROR(SEARCH(\"Heat\",P20,1)>0,FALSE),IF(IFERROR(SEARCH(\"Terminal\",P20,1)>0,FALSE),INDEX(INDIRECT(BS20),A20,3+MATCH(TRM,PTAC!$AC$9:$AE$9,0)),INDEX(INDIRECT(BS20),MATCH(TRM,BaselineRow,0),3)),\"\"))","v":""},"","","",{"$error":"#N/A"},{"$error":"#N/A"},{"$error":"#N/A"},0,{"$error":"#N/A"},{"$error":"#N/A"},{"$error":"#N/A"},{"$error":"#VALUE!"},{"$error":"#N/A"},{"$error":"#N/A"},{"$error":"#N/A"},{"$error":"#VALUE!"},0,0,0,0,{"$f":"INDEX('Utility Admin'!$P$2:$AD$2,1,MATCH($P20,'Utility Admin'!$P$3:$AD$3,0))","v":{"$error":"#N/A"}},{"$f":"INDEX('Utility Admin'!AE$2:AS$2,1,MATCH($P20,'Utility Admin'!$P$3:$AD$3,0))","v":{"$error":"#N/A"}},{"$f":"IF(kWhOverride=\"\",INDEX('Utility Admin'!$AT$2:$BH$2,1,MATCH($P20,'Utility Admin'!$P$3:$AD$3,0)),kWhOverride)","v":{"$error":"#N/A"}},"",{"$f":"INDEX('Equipment Lookups'!$AF$5:$BS$46,MATCH(Inventory!BL20,'Equipment Lookups'!$J$5:$J$46,0),MATCH(Inventory!DE20,'Equipment Lookups'!$AF$4:$BS$4,0))","v":{"$error":"#N/A"}},{"$f":"INDEX('Equipment Lookups'!$AE$5:$AE$46,MATCH(Inventory!BR20,'Equipment Lookups'!$J$5:$J$46,0))","v":{"$error":"#N/A"}},{"$error":"#N/A"},{"$error":"#N/A"},{"$error":"#N/A"},{"$error":"#N/A"},{"$error":"#N/A"},{"$error":"#N/A"},{"$error":"#N/A"},{"$error":"#N/A"},{"$error":"#N/A"},{"$error":"#N/A"},{"$error":"#N/A"},{"$error":"#N/A"},{"$error":"#N/A"},{"$error":"#N/A"},{"$error":"#N/A"},{"$error":"#N/A"},{"$error":"#N/A"},{"$error":"#N/A"},{"$error":"#N/A"},0,0,0]
[14,null,null,null,null,null,null,{"$f":"IFERROR(INDEX(DefaultUnits,MATCH(F21,EquipmentTypes,0),1),\"\")","v":""},null,null,null,null,null,null,null,null,null,{"$f":"IFERROR(INDEX(DefaultUnits,MATCH(P21,EquipmentTypes,0),1),\"\")","v":""},null,"",null,null,"","",null,null,null,null,{"$f":"IFERROR(INDEX(DefaultUnits,MATCH(P21,EquipmentTypes,0),3),\"\")","v":""},null,"",null,null,null,null,null,null,null,null,0,0,0,{"$f":"IFERROR(IF($AR$3<'Utility Admin'!$I$2,AR21,'Utility Admin'!$I$2/Inventory!$AR$3*AR21),0)","v":0},0,{"$f":"IFERROR(ProjectCost-SUM(AS22:AS45),0)","v":0},null,"","","","","",null,0,0,0,"UNITS","",0,{"$f":"IF('Project Info'!$D$7=\"TX\",INDEX(EFLH!$AB$4:$AB$30,MATCH(C21,TX_EFLHSanAntonio[Building Type],0),1),'Project Info'!$D$7&\"EquipmentType\")","v":"EquipmentType"},0,0,{"$f":"IF(IFERROR(SEARCH(\"Terminal\",F21,1)>0,FALSE),\"\",HLOOKUP(BI21,'Equipment Lookups'!$L$4:$AB$46,VLOOKUP(Inventory!BL21,'Equipment Lookups'!$J$5:$K$46,2,FALSE),TRUE))","v":{"$error":"#N/A"}},{"$f":"IF(L21=\"Unknown\",YEAR(TODAY())-INDEX('Equipment Lookups'!$AC$5:$AC$38,MATCH(Inventory!BL21,'Equipment Lookups'!$J$5:$J$38,0)),L21)","v":0},"",{"$error":"#N/A"},0,0,0,{"$f":"IF(IFERROR(SEARCH(\"Terminal\",P21,1)>0,FALSE),\"\",HLOOKUP(BO21,'Equipment Lookups'!$L$4:$AB$46,VLOOKUP(Inventory!BR21,'Equipment Lookups'!$J$5:$K$46,2,FALSE),TRUE))","v":{"$error":"#N/A"}},"",{"$error":"#N/A"},{"$f":"INDEX('Equipment Lookups'!$AD$5:$AD$46,MATCH(Inventory!BR21,'Equipment Lookups'!$J$5:$J$46,0))","v":{"$error":"#N/A"}},{"$f":"IFERROR(IF(AL21<>\"\",AL21,IF(State=\"TX\",INDEX(TX_EFLHSanAntonio[[CFAir Cooled Chiller]:[CFPTRoom]],MATCH(Inventory!C21,TX_EFLHSanAntonio[Building Type],0),MATCH(BT21,EFLH!$N$2:$Q$2,0)),VLOOKUP(C21,INDIRECT($BX$5),4,FALSE))),\"-\")","v":"-"},{"$f":"IFERROR(IF(AJ21<>\"\",AJ21,IF(State=\"TX\",INDEX(TX_EFLHSanAntonio[[EFLHcAir Cooled Chiller]:[EFLHcPTRoom]],MATCH(Inventory!C21,TX_EFLHSanAntonio[Building Type],0),MATCH(BT21,EFLH!$V$2:$Y$2,0)),VLOOKUP(C21,INDIRECT($BX$5),2,FALSE))),\"-\")","v":"-"},{"$f":"IFERROR(IF(AK21<>\"\",AK21,IF(State=\"TX\",INDEX(TX_EFLHSanAntonio[[EFLHhDX]:[EFLHhPTRoom]],MATCH(Inventory!C21,TX_EFLHSanAntonio[Building Type],0),MATCH(BT21,EFLH!$Z$2:$AA$2,0)),VLOOKUP(C21,INDIRECT($BX$5),3,FALSE))),\"-\")","v":"-"},{"$f":"IF(AM21<>\"\",AM21,IF(State=\"TX\",INDEX(TX_EFLHSanAntonio[[NCPAir Cooled Chiller]:[NCPPTRoom]],MATCH(Inventory!C21,TX_EFLHSanAntonio[Building Type],0),MATCH(BT21,EFLH!$R$2:$U$2,0)),0))","v":0},1,{"$error":"#N/A"},{"$error":"#N/A"},"",{"$f":"IF(AG21<>\"\",AG21,IF(IFERROR(SEARCH(\"Terminal\",P21,1)>0,FALSE),INDEX(INDIRECT(BS21),A21,MATCH(TRM,PTAC!$AC$9:$AE$9,0)),INDEX(INDIRECT(BS21),MATCH(TRM,BaselineRow,0),1)))","v":{"$error":"#N/A"}},{"$error":"#N/A"},{"$f":"IF(AI21<>\"\",12/3.412/AI21,IF(IFERROR(SEARCH(\"Heat\",P21,1)>0,FALSE),IF(IFERROR(SEARCH(\"Terminal\",P21,1)>0,FALSE),INDEX(INDIRECT(BS21),A21,3+MATCH(TRM,PTAC!$AC$9:$AE$9,0)),INDEX(INDIRECT(BS21),MATCH(TRM,BaselineRow,0),3)),\"\"))","v":""},{"$f":"IF(AG21<>\"\",AG21,IF(IFERROR(SEARCH(\"Terminal\",P21,1)>0,FALSE),INDEX(INDIRECT(BS21),A21,MATCH(TRM,PTAC!$AC$9:$AE$9,0)),INDEX(INDIRECT(BS21),MATCH(TRM,BaselineRow,0),1)))","v":{"$error":"#N/A"}},{"$error":"#N/A"},{"$f":"IF(AI21<>\"\",12/3.412/AI21,IF(IFERROR(SEARCH(\"Heat\",P21,1)>0,FALSE),IF(IFERROR(SEARCH(\"Terminal\",P21,1)>0,FALSE),INDEX(INDIRECT(BS21),A21,3+MATCH(TRM,PTAC!$AC$9:$AE$9,0)),INDEX(INDIRECT(BS21),MATCH(TRM,BaselineRow,0),3)),\"\"))","v":""},"","","",{"$error":"#N/A"},{"$error":"#N/A"},{"$error":"#N/A"},0,{"$error":"#N/A"},{"$error":"#N/A"},{"$error":"#N/A"},{"$error":"#VALUE!"},{"$error":"#N/A"},{"$error":"#N/A"},{"$error":"#N/A"},{"$error":"#VALUE!"},0,0,0,0,{"$f":"INDEX('Utility Admin'!$P$2:$AD$2,1,MATCH($P21,'Utility Admin'!$P$3:$AD$3,0))","v":{"$error":"#N/A"}},{"$f":"INDEX('Utility Admin'!AE$2:AS$2,1,MATCH($P21,'Utility Admin'!$P$3:$AD$3,0))","v":{"$error":"#N/A"}},{"$f":"IF(kWhOverride=\"\",INDEX('Utility Admin'!$AT$2:$BH$2,1,MATCH($P21,'Utility Admin'!$P$3:$AD$3,0)),kWhOverride)","v":{"$error":"#N/A"}},"",{"$f":"INDEX('Equipment Lookups'!$AF$5:$BS$46,MATCH(Inventory!BL21,'Equipment Lookups'!$J$5:$J$46,0),MATCH(Inventory!DE21,'Equipment Lookups'!$AF$4:$BS$4,0))","v":{"$error":"#N/A"}},{"$f":"INDEX('Equipment Lookups'!$AE$5:$AE$46,MATCH(Inventory!BR21,'Equipment Lookups'!$J$5:$J$46,0))","v":{"$error":"#N/A"}},{"$error":"#N/A"},{"$error":"#N/A"},{"$error":"#N/A"},{"$error":"#N/A"},{"$error":"#N/A"},{"$error":"#N/A"},{"$error":"#N/A"},{"$error":"#N/A"},{"$error":"#N/A"},{"$error":"#N/A"},{"$error":"#N/A"},{"$error":"#N/A"},{"$error":"#N/A"},{"$error":"#N/A"},{"$error":"#N/A"},{"$error":"#N/A"},{"$error":"#N/A"},{"$error":"#N/A"},{"$error":"#N/A"},0,0,0]
[15,null,null,null,null,null,null,{"$f":"IFERROR(INDEX(DefaultUnits,MATCH(F22,EquipmentTypes,0),1),\"\")","v":""},null,null,null,null,null,null,null,null,null,{"$f":"IFERROR(INDEX(DefaultUnits,MATCH(P22,EquipmentTypes,0),1),\"\")","v":""},null,"",null,null,"","",null,null,null,null,{"$f":"IFERROR(INDEX(DefaultUnits,MATCH(P22,EquipmentTypes,0),3),\"\")","v":""},null,"",null,null,null,null,null,null,null,null,0,0,0,{"$f":"IFERROR(IF($AR$3<'Utility Admin'!$I$2,AR22,'Utility Admin'!$I$2/Inventory!$AR$3*AR22),0)","v":0},0,{"$f":"IFERROR(ProjectCost-SUM(AS23:AS46),0)","v":0},null,"","","","","",null,0,0,0,"UNITS","",0,{"$f":"IF('Project Info'!$D$7=\"TX\",INDEX(EFLH!$AB$4:$AB$30,MATCH(C22,TX_EFLHSanAntonio[Building Type],0),1),'Project Info'!$D$7&\"EquipmentType\")","v":"EquipmentType"},0,0,{"$f":"IF(IFERROR(SEARCH(\"Terminal\",F22,1)>0,FALSE),\"\",HLOOKUP(BI22,'Equipment Lookups'!$L$4:$AB$46,VLOOKUP(Inventory!BL22,'Equipment Lookups'!$J$5:$K$46,2,FALSE),TRUE))","v":{"$error":"#N/A"}},{"$f":"IF(L22=\"Unknown\",YEAR(TODAY())-INDEX('Equipment Lookups'!$AC$5:$AC$38,MATCH(Inventory!BL22,'Equipment Lookups'!$J$5:$J$38,0)),L22)","v":0},"",{"$error":"#N/A"},0,0,0,{"$f":"IF(IFERROR(SEARCH(\"Terminal\",P22,1)>0,FALSE),\"\",HLOOKUP(BO22,'Equipment Lookups'!$L$4:$AB$46,VLOOKUP(Inventory!BR22,'Equipment Lookups'!$J$5:$K$46,2,FALSE),TRUE))","v":{"$error":"#N/A"}},"",{"$error":"#N/A"},{"$f":"INDEX('Equipment Lookups'!$AD$5:$AD$46,MATCH(Inventory!BR22,'Equipment Lookups'!$J$5:$J$46,0))","v":{"$error":"#N/A"}},{"$f":"IFERROR(IF(AL22<>\"\",AL22,IF(State=\"TX\",INDEX(TX_EFLHSanAntonio[[CFAir Cooled Chiller]:[CFPTRoom]],MATCH(Inventory!C22,TX_EFLHSanAntonio[Building Type],0),MATCH(BT22,EFLH!$N$2:$Q$2,0)),VLOOKUP(C22,INDIRECT($BX$5),4,FALSE))),\"-\")","v":"-"},{"$f":"IFERROR(IF(AJ22<>\"\",AJ22,IF(State=\"TX\",INDEX(TX_EFLHSanAntonio[[EFLHcAir Cooled Chiller]:[EFLHcPTRoom]],MATCH(Inventory!C22,TX_EFLHSanAntonio[Building Type],0),MATCH(BT22,EFLH!$V$2:$Y$2,0)),VLOOKUP(C22,INDIRECT($BX$5),2,FALSE))),\"-\")","v":"-"},{"$f":"IFERROR(IF(AK22<>\"\",AK22,IF(State=\"TX\",INDEX(TX_EFLHSanAntonio[[EFLHhDX]:[EFLHhPTRoom]],MATCH(Inventory!C22,TX_EFLHSanAntonio[Building Type],0),MATCH(BT22,EFLH!$Z$2:$AA$2,0)),VLOOKUP(C22,INDIRECT($BX$5),3,FALSE))),\"-\")","v":"-"},{"$f":"IF(AM22<>\"\",AM22,IF(State=\"TX\",INDEX(TX_EFLHSanAntonio[[NCPAir Cooled Chiller]:[NCPPTRoom]],MATCH(Inventory!C22,TX_EFLHSanAntonio[Building Type],0),MATCH(BT22,EFLH!$R$2:$U$2,0)),0))","v":0},1,{"$error":"#N/A"},{"$error":"#N/A"},"",{"$f":"IF(AG22<>\"\",AG22,IF(IFERROR(SEARCH(\"Terminal\",P22,1)>0,FALSE),INDEX(INDIRECT(BS22),A22,MATCH(TRM,PTAC!$AC$9:$AE$9,0)),INDEX(INDIRECT(BS22),MATCH(TRM,BaselineRow,0),1)))","v":{"$error":"#N/A"}},{"$error":"#N/A"},{"$f":"IF(AI22<>\"\",12/3.412/AI22,IF(IFERROR(SEARCH(\"Heat\",P22,1)>0,FALSE),IF(IFERROR(SEARCH(\"Terminal\",P22,1)>0,FALSE),INDEX(INDIRECT(BS22),A22,3+MATCH(TRM,PTAC!$AC$9:$AE$9,0)),INDEX(INDIRECT(BS22),MATCH(TRM,BaselineRow,0),3)),\"\"))","v":""},{"$f":"IF(AG22<>\"\",AG22,IF(IFERROR(SEARCH(\"Terminal\",P22,1)>0,FALSE),INDEX(INDIRECT(BS22),A22,MATCH(TRM,PTAC!$AC$9:$AE$9,0)),INDEX(INDIRECT(BS22),MATCH(TRM,BaselineRow,0),1)))","v":{"$error":"#N/A"}},{"$error":"#N/A"},{"$f":"IF(AI22<>\"\",12/3.412/AI22,IF(IFERROR(SEARCH(\"Heat\",P22,1)>0,FALSE),IF(IFERROR(SEARCH(\"Terminal\",P22,1)>0,FALSE),INDEX(INDIRECT(BS22),A22,3+MATCH(TRM,PTAC!$AC$9:$AE$9,0)),INDEX(INDIRECT(BS22),MATCH(TRM,BaselineRow,0),3)),\"\"))","v":""},"","","",{"$error":"#N/A"},{"$error":"#N/A"},{"$error":"#N/A"},0,{"$error":"#N/A"},{"$error":"#N/A"},{"$error":"#N/A"},{"$error":"#VALUE!"},{"$error":"#N/A"},{"$error":"#N/A"},{"$error":"#N/A"},{"$error":"#VALUE!"},0,0,0,0,{"$f":"INDEX('Utility Admin'!$P$2:$AD$2,1,MATCH($P22,'Utility Admin'!$P$3:$AD$3,0))","v":{"$error":"#N/A"}},{"$f":"INDEX('Utility Admin'!AE$2:AS$2,1,MATCH($P22,'Utility Admin'!$P$3:$AD$3,0))","v":{"$error":"#N/A"}},{"$f":"IF(kWhOverride=\"\",INDEX('Utility Admin'!$AT$2:$BH$2,1,MATCH($P22,'Utility Admin'!$P$3:$AD$3,0)),kWhOverride)","v":{"$error":"#N/A"}},"",{"$f":"INDEX('Equipment Lookups'!$AF$5:$BS$46,MATCH(Inventory!BL22,'Equipment Lookups'!$J$5:$J$46,0),MATCH(Inventory!DE22,'Equipment Lookups'!$AF$4:$BS$4,0))","v":{"$error":"#N/A"}},{"$f":"INDEX('Equipment Lookups'!$AE$5:$AE$46,MATCH(Inventory!BR22,'Equipment Lookups'!$J$5:$J$46,0))","v":{"$error":"#N/A"}},{"$error":"#N/A"},{"$error":"#N/A"},{"$error":"#N/A"},{"$error":"#N/A"},{"$error":"#N/A"},{"$error":"#N/A"},{"$error":"#N/A"},{"$error":"#N/A"},{"$error":"#N/A"},{"$error":"#N/A"},{"$error":"#N/A"},{"$error":"#N/A"},{"$error":"#N/A"},{"$error":"#N/A"},{"$error":"#N/A"},{"$error":"#N/A"},{"$error":"#N/A"},{"$error":"#N/A"},{"$error":"#N/A"},0,0,0]
[16,null,null,null,null,null,null,{"$f":"IFERROR(INDEX(DefaultUnits,MATCH(F23,EquipmentTypes,0),1),\"\")","v":""},null,null,null,null,null,null,null,null,null,{"$f":"IFERROR(INDEX(DefaultUnits,MATCH(P23,EquipmentTypes,0),1),\"\")","v":""},null,"",null,null,"","",null,null,null,null,{"$f":"IFERROR(INDEX(DefaultUnits,MATCH(P23,EquipmentTypes,0),3),\"\")","v":""},null,"",null,null,null,null,null,null,null,null,0,0,0,{"$f":"IFERROR(IF($AR$3<'Utility Admin'!$I$2,AR23,'Utility Admin'!$I$2/Inventory!$AR$3*AR23),0)","v":0},0,{"$f":"IFERROR(ProjectCost-SUM(AS24:AS47),0)","v":0},null,"","","","","",null,0,0,0,"UNITS","",0,{"$f":"IF('Project Info'!$D$7=\"TX\",INDEX(EFLH!$AB$4:$AB$30,MATCH(C23,TX_EFLHSanAntonio[Building Type],0),1),'Project Info'!$D$7&\"EquipmentType\")","v":"EquipmentType"},0,0,{"$f":"IF(IFERROR(SEARCH(\"Terminal\",F23,1)>0,FALSE),\"\",HLOOKUP(BI23,'Equipment Lookups'!$L$4:$AB$46,VLOOKUP(Inventory!BL23,'Equipment Lookups'!$J$5:$K$46,2,FALSE),TRUE))","v":{"$error":"#N/A"}},{"$f":"IF(L23=\"Unknown\",YEAR(TODAY())-INDEX('Equipment Lookups'!$AC$5:$AC$38,MATCH(Inventory!BL23,'Equipment Lookups'!$J$5:$J$38,0)),L23)","v":0},"",{"$error":"#N/A"},0,0,0,{"$f":"IF(IFERROR(SEARCH(\"Terminal\",P23,1)>0,FALSE),\"\",HLOOKUP(BO23,'Equipment Lookups'!$L$4:$AB$46,VLOOKUP(Inventory!BR23,'Equipment Lookups'!$J$5:$K$46,2,FALSE),TRUE))","v":{"$error":"#N/A"}},"",{"$error":"#N/A"},{"$f":"INDEX('Equipment Lookups'!$AD$5:$AD$46,MATCH(Inventory!BR23,'Equipment Lookups'!$J$5:$J$46,0))","v":{"$error":"#N/A"}},{"$f":"IFERROR(IF(AL23<>\"\",AL23,IF(State=\"TX\",INDEX(TX_EFLHSanAntonio[[CFAir Cooled Chiller]:[CFPTRoom]],MATCH(Inventory!C23,TX_EFLHSanAntonio[Building Type],0),MATCH(BT23,EFLH!$N$2:$Q$2,0)),VLOOKUP(C23,INDIRECT($BX$5),4,FALSE))),\"-\")","v":"-"},{"$f":"IFERROR(IF(AJ23<>\"\",AJ23,IF(State=\"TX\",INDEX(TX_EFLHSanAntonio[[EFLHcAir Cooled Chiller]:[EFLHcPTRoom]],MATCH(Inventory!C23,TX_EFLHSanAntonio[Building Type],0),MATCH(BT23,EFLH!$V$2:$Y$2,0)),VLOOKUP(C23,INDIRECT($BX$5),2,FALSE))),\"-\")","v":"-"},{"$f":"IFERROR(IF(AK23<>\"\",AK23,IF(State=\"TX\",INDEX(TX_EFLHSanAntonio[[EFLHhDX]:[EFLHhPTRoom]],MATCH(Inventory!C23,TX_EFLHSanAntonio[Building Type],0),MATCH(BT23,EFLH!$Z$2:$AA$2,0)),VLOOKUP(C23,INDIRECT($BX$5),3,FALSE))),\"-\")","v":"-"},{"$f":"IF(AM23<>\"\",AM23,IF(State=\"TX\",INDEX(TX_EFLHSanAntonio[[NCPAir Cooled Chiller]:[NCPPTRoom]],MATCH(Inventory!C23,TX_EFLHSanAntonio[Building Type],0),MATCH(BT23,EFLH!$R$2:$U$2,0)),0))","v":0},1,{"$error":"#N/A"},{"$error":"#N/A"},"",{"$f":"IF(AG23<>\"\",AG23,IF(IFERROR(SEARCH(\"Terminal\",P23,1)>0,FALSE),INDEX(INDIRECT(BS23),A23,MATCH(TRM,PTAC!$AC$9:$AE$9,0)),INDEX(INDIRECT(BS23),MATCH(TRM,BaselineRow,0),1)))","v":{"$error":"#N/A"}},{"$error":"#N/A"},{"$f":"IF(AI23<>\"\",12/3.412/AI23,IF(IFERROR(SEARCH(\"Heat\",P23,1)>0,FALSE),IF(IFERROR(SEARCH(\"Terminal\",P23,1)>0,FALSE),INDEX(INDIRECT(BS23),A23,3+MATCH(TRM,PTAC!$AC$9:$AE$9,0)),INDEX(INDIRECT(BS23),MATCH(TRM,BaselineRow,0),3)),\"\"))","v":""},{"$f":"IF(AG23<>\"\",AG23,IF(IFERROR(SEARCH(\"Terminal\",P23,1)>0,FALSE),INDEX(INDIRECT(BS23),A23,MATCH(TRM,PTAC!$AC$9:$AE$9,0)),INDEX(INDIRECT(BS23),MATCH(TRM,BaselineRow,0),1)))","v":{"$error":"#N/A"}},{"$error":"#N/A"},{"$f":"IF(AI23<>\"\",12/3.412/AI23,IF(IFERROR(SEARCH(\"Heat\",P23,1)>0,FALSE),IF(IFERROR(SEARCH(\"Terminal\",P23,1)>0,FALSE),INDEX(INDIRECT(BS23),A23,3+MATCH(TRM,PTAC!$AC$9:$AE$9,0)),INDEX(INDIRECT(BS23),MATCH(TRM,BaselineRow,0),3)),\"\"))","v":""},"","","",{"$error":"#N/A"},{"$error":"#N/A"},{"$error":"#N/A"},0,{"$error":"#N/A"},{"$error":"#N/A"},{"$error":"#N/A"},{"$error":"#VALUE!"},{"$error":"#N/A"},{"$error":"#N/A"},{"$error":"#N/A"},{"$error":"#VALUE!"},0,0,0,0,{"$f":"INDEX('Utility Admin'!$P$2:$AD$2,1,MATCH($P23,'Utility Admin'!$P$3:$AD$3,0))","v":{"$error":"#N/A"}},{"$f":"INDEX('Utility Admin'!AE$2:AS$2,1,MATCH($P23,'Utility Admin'!$P$3:$AD$3,0))","v":{"$error":"#N/A"}},{"$f":"IF(kWhOverride=\"\",INDEX('Utility Admin'!$AT$2:$BH$2,1,MATCH($P23,'Utility Admin'!$P$3:$AD$3,0)),kWhOverride)","v":{"$error":"#N/A"}},"",{"$f":"INDEX('Equipment Lookups'!$AF$5:$BS$46,MATCH(Inventory!BL23,'Equipment Lookups'!$J$5:$J$46,0),MATCH(Inventory!DE23,'Equipment Lookups'!$AF$4:$BS$4,0))","v":{"$error":"#N/A"}},{"$f":"INDEX('Equipment Lookups'!$AE$5:$AE$46,MATCH(Inventory!BR23,'Equipment Lookups'!$J$5:$J$46,0))","v":{"$error":"#N/A"}},{"$error":"#N/A"},{"$error":"#N/A"},{"$error":"#N/A"},{"$error":"#N/A"},{"$error":"#N/A"},{"$error":"#N/A"},{"$error":"#N/A"},{"$error":"#N/A"},{"$error":"#N/A"},{"$error":"#N/A"},{"$error":"#N/A"},{"$error":"#N/A"},{"$error":"#N/A"},{"$error":"#N/A"},{"$error":"#N/A"},{"$error":"#N/A"},{"$error":"#N/A"},{"$error":"#N/A"},{"$error":"#N/A"},0,0,0]
[17,null,null,null,null,null,null,{"$f":"IFERROR(INDEX(DefaultUnits,MATCH(F24,EquipmentTypes,0),1),\"\")","v":""},null,null,null,null,null,null,null,null,null,{"$f":"IFERROR(INDEX(DefaultUnits,MATCH(P24,EquipmentTypes,0),1),\"\")","v":""},null,"",null,null,"","",null,null,null,null,{"$f":"IFERROR(INDEX(DefaultUnits,MATCH(P24,EquipmentTypes,0),3),\"\")","v":""},null,"",null,null,null,null,null,null,null,null,0,0,0,{"$f":"IFERROR(IF($AR$3<'Utility Admin'!$I$2,AR24,'Utility Admin'!$I$2/Inventory!$AR$3*AR24),0)","v":0},0,{"$f":"IFERROR(ProjectCost-SUM(AS25:AS48),0)","v":0},null,"","","","","",null,0,0,0,"UNITS","",0,{"$f":"IF('Project Info'!$D$7=\"TX\",INDEX(EFLH!$AB$4:$AB$30,MATCH(C24,TX_EFLHSanAntonio[Building Type],0),1),'Project Info'!$D$7&\"EquipmentType\")","v":"EquipmentType"},0,0,{"$f":"IF(IFERROR(SEARCH(\"Terminal\",F24,1)>0,FALSE),\"\",HLOOKUP(BI24,'Equipment Lookups'!$L$4:$AB$46,VLOOKUP(Inventory!BL24,'Equipment Lookups'!$J$5:$K$46,2,FALSE),TRUE))","v":{"$error":"#N/A"}},{"$f":"IF(L24=\"Unknown\",YEAR(TODAY())-INDEX('Equipment Lookups'!$AC$5:$AC$38,MATCH(Inventory!BL24,'Equipment Lookups'!$J$5:$J$38,0)),L24)","v":0},"",{"$error":"#N/A"},0,0,0,{"$f":"IF(IFERROR(SEARCH(\"Terminal\",P24,1)>0,FALSE),\"\",HLOOKUP(BO24,'Equipment Lookups'!$L$4:$AB$46,VLOOKUP(Inventory!BR24,'Equipment Lookups'!$J$5:$K$46,2,FALSE),TRUE))","v":{"$error":"#N/A"}},"",{"$error":"#N/A"},{"$f":"INDEX('Equipment Lookups'!$AD$5:$AD$46,MATCH(Inventory!BR24,'Equipment Lookups'!$J$5:$J$46,0))","v":{"$error":"#N/A"}},{"$f":"IFERROR(IF(AL24<>\"\",AL24,IF(State=\"TX\",INDEX(TX_EFLHSanAntonio[[CFAir Cooled Chiller]:[CFPTRoom]],MATCH(Inventory!C24,TX_EFLHSanAntonio[Building Type],0),MATCH(BT24,EFLH!$N$2:$Q$2,0)),VLOOKUP(C24,INDIRECT($BX$5),4,FALSE))),\"-\")","v":"-"},{"$f":"IFERROR(IF(AJ24<>\"\",AJ24,IF(State=\"TX\",INDEX(TX_EFLHSanAntonio[[EFLHcAir Cooled Chiller]:[EFLHcPTRoom]],MATCH(Inventory!C24,TX_EFLHSanAntonio[Building Type],0),MATCH(BT24,EFLH!$V$2:$Y$2,0)),VLOOKUP(C24,INDIRECT($BX$5),2,FALSE))),\"-\")","v":"-"},{"$f":"IFERROR(IF(AK24<>\"\",AK24,IF(State=\"TX\",INDEX(TX_EFLHSanAntonio[[EFLHhDX]:[EFLHhPTRoom]],MATCH(Inventory!C24,TX_EFLHSanAntonio[Building Type],0),MATCH(BT24,EFLH!$Z$2:$AA$2,0)),VLOOKUP(C24,INDIRECT($BX$5),3,FALSE))),\"-\")","v":"-"},{"$f":"IF(AM24<>\"\",AM24,IF(State=\"TX\",INDEX(TX_EFLHSanAntonio[[NCPAir Cooled Chiller]:[NCPPTRoom]],MATCH(Inventory!C24,TX_EFLHSanAntonio[Building Type],0),MATCH(BT24,EFLH!$R$2:$U$2,0)),0))","v":0},1,{"$error":"#N/A"},{"$error":"#N/A"},"",{"$f":"IF(AG24<>\"\",AG24,IF(IFERROR(SEARCH(\"Terminal\",P24,1)>0,FALSE),INDEX(INDIRECT(BS24),A24,MATCH(TRM,PTAC!$AC$9:$AE$9,0)),INDEX(INDIRECT(BS24),MATCH(TRM,BaselineRow,0),1)))","v":{"$error":"#N/A"}},{"$error":"#N/A"},{"$f":"IF(AI24<>\"\",12/3.412/AI24,IF(IFERROR(SEARCH(\"Heat\",P24,1)>0,FALSE),IF(IFERROR(SEARCH(\"Terminal\",P24,1)>0,FALSE),INDEX(INDIRECT(BS24),A24,3+MATCH(TRM,PTAC!$AC$9:$AE$9,0)),INDEX(INDIRECT(BS24),MATCH(TRM,BaselineRow,0),3)),\"\"))","v":""},{"$f":"IF(AG24<>\"\",AG24,IF(IFERROR(SEARCH(\"Terminal\",P24,1)>0,FALSE),INDEX(INDIRECT(BS24),A24,MATCH(TRM,PTAC!$AC$9:$AE$9,0)),INDEX(INDIRECT(BS24),MATCH(TRM,BaselineRow,0),1)))","v":{"$error":"#N/A"}},{"$error":"#N/A"},{"$f":"IF(AI24<>\"\",12/3.412/AI24,IF(IFERROR(SEARCH(\"Heat\",P24,1)>0,FALSE),IF(IFERROR(SEARCH(\"Terminal\",P24,1)>0,FALSE),INDEX(INDIRECT(BS24),A24,3+MATCH(TRM,PTAC!$AC$9:$AE$9,0)),INDEX(INDIRECT(BS24),MATCH(TRM,BaselineRow,0),3)),\"\"))","v":""},"","","",{"$error":"#N/A"},{"$error":"#N/A"},{"$error":"#N/A"},0,{"$error":"#N/A"},{"$error":"#N/A"},{"$error":"#N/A"},{"$error":"#VALUE!"},{"$error":"#N/A"},{"$error":"#N/A"},{"$error":"#N/A"},{"$error":"#VALUE!"},0,0,0,0,{"$f":"INDEX('Utility Admin'!$P$2:$AD$2,1,MATCH($P24,'Utility Admin'!$P$3:$AD$3,0))","v":{"$error":"#N/A"}},{"$f":"INDEX('Utility Admin'!AE$2:AS$2,1,MATCH($P24,'Utility Admin'!$P$3:$AD$3,0))","v":{"$error":"#N/A"}},{"$f":"IF(kWhOverride=\"\",INDEX('Utility Admin'!$AT$2:$BH$2,1,MATCH($P24,'Utility Admin'!$P$3:$AD$3,0)),kWhOverride)","v":{"$error":"#N/A"}},"",{"$f":"INDEX('Equipment Lookups'!$AF$5:$BS$46,MATCH(Inventory!BL24,'Equipment Lookups'!$J$5:$J$46,0),MATCH(Inventory!DE24,'Equipment Lookups'!$AF$4:$BS$4,0))","v":{"$error":"#N/A"}},{"$f":"INDEX('Equipment Lookups'!$AE$5:$AE$46,MATCH(Inventory!BR24,'Equipment Lookups'!$J$5:$J$46,0))","v":{"$error":"#N/A"}},{"$error":"#N/A"},{"$error":"#N/A"},{"$error":"#N/A"},{"$error":"#N/A"},{"$error":"#N/A"},{"$error":"#N/A"},{"$error":"#N/A"},{"$error":"#N/A"},{"$error":"#N/A"},{"$error":"#N/A"},{"$error":"#N/A"},{"$error":"#N/A"},{"$error":"#N/A"},{"$error":"#N/A"},{"$error":"#N/A"},{"$error":"#N/A"},{"$error":"#N/A"},{"$error":"#N/A"},{"$error":"#N/A"},0,0,0]
[18,null,null,null,null,null,null,{"$f":"IFERROR(INDEX(DefaultUnits,MATCH(F25,EquipmentTypes,0),1),\"\")","v":""},null,null,null,null,null,null,null,null,null,{"$f":"IFERROR(INDEX(DefaultUnits,MATCH(P25,EquipmentTypes,0),1),\"\")","v":""},null,"",null,null,"","",null,null,null,null,{"$f":"IFERROR(INDEX(DefaultUnits,MATCH(P25,EquipmentTypes,0),3),\"\")","v":""},null,"",null,null,null,null,null,null,null,null,0,0,0,{"$f":"IFERROR(IF($AR$3<'Utility Admin'!$I$2,AR25,'Utility Admin'!$I$2/Inventory!$AR$3*AR25),0)","v":0},0,{"$f":"IFERROR(ProjectCost-SUM(AS26:AS49),0)","v":0},null,"","","","","",null,0,0,0,"UNITS","",0,{"$f":"IF('Project Info'!$D$7=\"TX\",INDEX(EFLH!$AB$4:$AB$30,MATCH(C25,TX_EFLHSanAntonio[Building Type],0),1),'Project Info'!$D$7&\"EquipmentType\")","v":"EquipmentType"},0,0,{"$f":"IF(IFERROR(SEARCH(\"Terminal\",F25,1)>0,FALSE),\"\",HLOOKUP(BI25,'Equipment Lookups'!$L$4:$AB$46,VLOOKUP(Inventory!BL25,'Equipment Lookups'!$J$5:$K$46,2,FALSE),TRUE))","v":{"$error":"#N/A"}},{"$f":"IF(L25=\"Unknown\",YEAR(TODAY())-INDEX('Equipment Lookups'!$AC$5:$AC$38,MATCH(Inventory!BL25,'Equipment Lookups'!$J$5:$J$38,0)),L25)","v":0},"",{"$error":"#N/A"},0,0,0,{"$f":"IF(IFERROR(SEARCH(\"Terminal\",P25,1)>0,FALSE),\"\",HLOOKUP(BO25,'Equipment Lookups'!$L$4:$AB$46,VLOOKUP(Inventory!BR25,'Equipment Lookups'!$J$5:$K$46,2,FALSE),TRUE))","v":{"$error":"#N/A"}},"",{"$error":"#N/A"},{"$f":"INDEX('Equipment Lookups'!$AD$5:$AD$46,MATCH(Inventory!BR25,'Equipment Lookups'!$J$5:$J$46,0))","v":{"$error":"#N/A"}},{"$f":"IFERROR(IF(AL25<>\"\",AL25,IF(State=\"TX\",INDEX(TX_EFLHSanAntonio[[CFAir Cooled Chiller]:[CFPTRoom]],MATCH(Inventory!C25,TX_EFLHSanAntonio[Building Type],0),MATCH(BT25,EFLH!$N$2:$Q$2,0)),VLOOKUP(C25,INDIRECT($BX$5),4,FALSE))),\"-\")","v":"-"},{"$f":"IFERROR(IF(AJ25<>\"\",AJ25,IF(State=\"TX\",INDEX(TX_EFLHSanAntonio[[EFLHcAir Cooled Chiller]:[EFLHcPTRoom]],MATCH(Inventory!C25,TX_EFLHSanAntonio[Building Type],0),MATCH(BT25,EFLH!$V$2:$Y$2,0)),VLOOKUP(C25,INDIRECT($BX$5),2,FALSE))),\"-\")","v":"-"},{"$f":"IFERROR(IF(AK25<>\"\",AK25,IF(State=\"TX\",INDEX(TX_EFLHSanAntonio[[EFLHhDX]:[EFLHhPTRoom]],MATCH(Inventory!C25,TX_EFLHSanAntonio[Building Type],0),MATCH(BT25,EFLH!$Z$2:$AA$2,0)),VLOOKUP(C25,INDIRECT($BX$5),3,FALSE))),\"-\")","v":"-"},{"$f":"IF(AM25<>\"\",AM25,IF(State=\"TX\",INDEX(TX_EFLHSanAntonio[[NCPAir Cooled Chiller]:[NCPPTRoom]],MATCH(Inventory!C25,TX_EFLHSanAntonio[Building Type],0),MATCH(BT25,EFLH!$R$2:$U$2,0)),0))","v":0},1,{"$error":"#N/A"},{"$error":"#N/A"},"",{"$f":"IF(AG25<>\"\",AG25,IF(IFERROR(SEARCH(\"Terminal\",P25,1)>0,FALSE),INDEX(INDIRECT(BS25),A25,MATCH(TRM,PTAC!$AC$9:$AE$9,0)),INDEX(INDIRECT(BS25),MATCH(TRM,BaselineRow,0),1)))","v":{"$error":"#N/A"}},{"$error":"#N/A"},{"$f":"IF(AI25<>\"\",12/3.412/AI25,IF(IFERROR(SEARCH(\"Heat\",P25,1)>0,FALSE),IF(IFERROR(SEARCH(\"Terminal\",P25,1)>0,FALSE),INDEX(INDIRECT(BS25),A25,3+MATCH(TRM,PTAC!$AC$9:$AE$9,0)),INDEX(INDIRECT(BS25),MATCH(TRM,BaselineRow,0),3)),\"\"))","v":""},{"$f":"IF(AG25<>\"\",AG25,IF(IFERROR(SEARCH(\"Terminal\",P25,1)>0,FALSE),INDEX(INDIRECT(BS25),A25,MATCH(TRM,PTAC!$AC$9:$AE$9,0)),INDEX(INDIRECT(BS25),MATCH(TRM,BaselineRow,0),1)))","v":{"$error":"#N/A"}},{"$error":"#N/A"},{"$f":"IF(AI25<>\"\",12/3.412/AI25,IF(IFERROR(SEARCH(\"Heat\",P25,1)>0,FALSE),IF(IFERROR(SEARCH(\"Terminal\",P25,1)>0,FALSE),INDEX(INDIRECT(BS25),A25,3+MATCH(TRM,PTAC!$AC$9:$AE$9,0)),INDEX(INDIRECT(BS25),MATCH(TRM,BaselineRow,0),3)),\"\"))","v":""},"","","",{"$error":"#N/A"},{"$error":"#N/A"},{"$error":"#N/A"},0,{"$error":"#N/A"},{"$error":"#N/A"},{"$error":"#N/A"},{"$error":"#VALUE!"},{"$error":"#N/A"},{"$error":"#N/A"},{"$error":"#N/A"},{"$error":"#VALUE!"},0,0,0,0,{"$f":"INDEX('Utility Admin'!$P$2:$AD$2,1,MATCH($P25,'Utility Admin'!$P$3:$AD$3,0))","v":{"$error":"#N/A"}},{"$f":"INDEX('Utility Admin'!AE$2:AS$2,1,MATCH($P25,'Utility Admin'!$P$3:$AD$3,0))","v":{"$error":"#N/A"}},{"$f":"IF(kWhOverride=\"\",INDEX('Utility Admin'!$AT$2:$BH$2,1,MATCH($P25,'Utility Admin'!$P$3:$AD$3,0)),kWhOverride)","v":{"$error":"#N/A"}},"",{"$f":"INDEX('Equipment Lookups'!$AF$5:$BS$46,MATCH(Inventory!BL25,'Equipment Lookups'!$J$5:$J$46,0),MATCH(Inventory!DE25,'Equipment Lookups'!$AF$4:$BS$4,0))","v":{"$error":"#N/A"}},{"$f":"INDEX('Equipment Lookups'!$AE$5:$AE$46,MATCH(Inventory!BR25,'Equipment Lookups'!$J$5:$J$46,0))","v":{"$error":"#N/A"}},{"$error":"#N/A"},{"$error":"#N/A"},{"$error":"#N/A"},{"$error":"#N/A"},{"$error":"#N/A"},{"$error":"#N/A"},{"$error":"#N/A"},{"$error":"#N/A"},{"$error":"#N/A"},{"$error":"#N/A"},{"$error":"#N/A"},{"$error":"#N/A"},{"$error":"#N/A"},{"$error":"#N/A"},{"$error":"#N/A"},{"$error":"#N/A"},{"$error":"#N/A"},{"$error":"#N/A"},{"$error":"#N/A"},0,0,0]
[19,null,null,null,null,null,null,{"$f":"IFERROR(INDEX(DefaultUnits,MATCH(F26,EquipmentTypes,0),1),\"\")","v":""},null,null,null,null,null,null,null,null,null,{"$f":"IFERROR(INDEX(DefaultUnits,MATCH(P26,EquipmentTypes,0),1),\"\")","v":""},null,"",null,null,"","",null,null,null,null,{"$f":"IFERROR(INDEX(DefaultUnits,MATCH(P26,EquipmentTypes,0),3),\"\")","v":""},null,"",null,null,null,null,null,null,null,null,0,0,0,{"$f":"IFERROR(IF($AR$3<'Utility Admin'!$I$2,AR26,'Utility Admin'!$I$2/Inventory!$AR$3*AR26),0)","v":0},0,{"$f":"IFERROR(ProjectCost-SUM(AS27:AS50),0)","v":0},null,"","","","","",null,0,0,0,"UNITS","",0,{"$f":"IF('Project Info'!$D$7=\"TX\",INDEX(EFLH!$AB$4:$AB$30,MATCH(C26,TX_EFLHSanAntonio[Building Type],0),1),'Project Info'!$D$7&\"EquipmentType\")","v":"EquipmentType"},0,0,{"$f":"IF(IFERROR(SEARCH(\"Terminal\",F26,1)>0,FALSE),\"\",HLOOKUP(BI26,'Equipment Lookups'!$L$4:$AB$46,VLOOKUP(Inventory!BL26,'Equipment Lookups'!$J$5:$K$46,2,FALSE),TRUE))","v":{"$error":"#N/A"}},{"$f":"IF(L26=\"Unknown\",YEAR(TODAY())-INDEX('Equipment Lookups'!$AC$5:$AC$38,MATCH(Inventory!BL26,'Equipment Lookups'!$J$5:$J$38,0)),L26)","v":0},"",{"$error":"#N/A"},0,0,0,{"$f":"IF(IFERROR(SEARCH(\"Terminal\",P26,1)>0,FALSE),\"\",HLOOKUP(BO26,'Equipment Lookups'!$L$4:$AB$46,VLOOKUP(Inventory!BR26,'Equipment Lookups'!$J$5:$K$46,2,FALSE),TRUE))","v":{"$error":"#N/A"}},"",{"$error":"#N/A"},{"$f":"INDEX('Equipment Lookups'!$AD$5:$AD$46,MATCH(Inventory!BR26,'Equipment Lookups'!$J$5:$J$46,0))","v":{"$error":"#N/A"}},{"$f":"IFERROR(IF(AL26<>\"\",AL26,IF(State=\"TX\",INDEX(TX_EFLHSanAntonio[[CFAir Cooled Chiller]:[CFPTRoom]],MATCH(Inventory!C26,TX_EFLHSanAntonio[Building Type],0),MATCH(BT26,EFLH!$N$2:$Q$2,0)),VLOOKUP(C26,INDIRECT($BX$5),4,FALSE))),\"-\")","v":"-"},{"$f":"IFERROR(IF(AJ26<>\"\",AJ26,IF(State=\"TX\",INDEX(TX_EFLHSanAntonio[[EFLHcAir Cooled Chiller]:[EFLHcPTRoom]],MATCH(Inventory!C26,TX_EFLHSanAntonio[Building Type],0),MATCH(BT26,EFLH!$V$2:$Y$2,0)),VLOOKUP(C26,INDIRECT($BX$5),2,FALSE))),\"-\")","v":"-"},{"$f":"IFERROR(IF(AK26<>\"\",AK26,IF(State=\"TX\",INDEX(TX_EFLHSanAntonio[[EFLHhDX]:[EFLHhPTRoom]],MATCH(Inventory!C26,TX_EFLHSanAntonio[Building Type],0),MATCH(BT26,EFLH!$Z$2:$AA$2,0)),VLOOKUP(C26,INDIRECT($BX$5),3,FALSE))),\"-\")","v":"-"},{"$f":"IF(AM26<>\"\",AM26,IF(State=\"TX\",INDEX(TX_EFLHSanAntonio[[NCPAir Cooled Chiller]:[NCPPTRoom]],MATCH(Inventory!C26,TX_EFLHSanAntonio[Building Type],0),MATCH(BT26,EFLH!$R$2:$U$2,0)),0))","v":0},1,{"$error":"#N/A"},{"$error":"#N/A"},"",{"$f":"IF(AG26<>\"\",AG26,IF(IFERROR(SEARCH(\"Terminal\",P26,1)>0,FALSE),INDEX(INDIRECT(BS26),A26,MATCH(TRM,PTAC!$AC$9:$AE$9,0)),INDEX(INDIRECT(BS26),MATCH(TRM,BaselineRow,0),1)))","v":{"$error":"#N/A"}},{"$error":"#N/A"},{"$f":"IF(AI26<>\"\",12/3.412/AI26,IF(IFERROR(SEARCH(\"Heat\",P26,1)>0,FALSE),IF(IFERROR(SEARCH(\"Terminal\",P26,1)>0,FALSE),INDEX(INDIRECT(BS26),A26,3+MATCH(TRM,PTAC!$AC$9:$AE$9,0)),INDEX(INDIRECT(BS26),MATCH(TRM,BaselineRow,0),3)),\"\"))","v":""},{"$f":"IF(AG26<>\"\",AG26,IF(IFERROR(SEARCH(\"Terminal\",P26,1)>0,FALSE),INDEX(INDIRECT(BS26),A26,MATCH(TRM,PTAC!$AC$9:$AE$9,0)),INDEX(INDIRECT(BS26),MATCH(TRM,BaselineRow,0),1)))","v":{"$error":"#N/A"}},{"$error":"#N/A"},{"$f":"IF(AI26<>\"\",12/3.412/AI26,IF(IFERROR(SEARCH(\"Heat\",P26,1)>0,FALSE),IF(IFERROR(SEARCH(\"Terminal\",P26,1)>0,FALSE),INDEX(INDIRECT(BS26),A26,3+MATCH(TRM,PTAC!$AC$9:$AE$9,0)),INDEX(INDIRECT(BS26),MATCH(TRM,BaselineRow,0),3)),\"\"))","v":""},"","","",{"$error":"#N/A"},{"$error":"#N/A"},{"$error":"#N/A"},0,{"$error":"#N/A"},{"$error":"#N/A"},{"$error":"#N/A"},{"$error":"#VALUE!"},{"$error":"#N/A"},{"$error":"#N/A"},{"$error":"#N/A"},{"$error":"#VALUE!"},0,0,0,0,{"$f":"INDEX('Utility Admin'!$P$2:$AD$2,1,MATCH($P26,'Utility Admin'!$P$3:$AD$3,0))","v":{"$error":"#N/A"}},{"$f":"INDEX('Utility Admin'!AE$2:AS$2,1,MATCH($P26,'Utility Admin'!$P$3:$AD$3,0))","v":{"$error":"#N/A"}},{"$f":"IF(kWhOverride=\"\",INDEX('Utility Admin'!$AT$2:$BH$2,1,MATCH($P26,'Utility Admin'!$P$3:$AD$3,0)),kWhOverride)","v":{"$error":"#N/A"}},"",{"$f":"INDEX('Equipment Lookups'!$AF$5:$BS$46,MATCH(Inventory!BL26,'Equipment Lookups'!$J$5:$J$46,0),MATCH(Inventory!DE26,'Equipment Lookups'!$AF$4:$BS$4,0))","v":{"$error":"#N/A"}},{"$f":"INDEX('Equipment Lookups'!$AE$5:$AE$46,MATCH(Inventory!BR26,'Equipment Lookups'!$J$5:$J$46,0))","v":{"$error":"#N/A"}},{"$error":"#N/A"},{"$error":"#N/A"},{"$error":"#N/A"},{"$error":"#N/A"},{"$error":"#N/A"},{"$error":"#N/A"},{"$error":"#N/A"},{"$error":"#N/A"},{"$error":"#N/A"},{"$error":"#N/A"},{"$error":"#N/A"},{"$error":"#N/A"},{"$error":"#N/A"},{"$error":"#N/A"},{"$error":"#N/A"},{"$error":"#N/A"},{"$error":"#N/A"},{"$error":"#N/A"},{"$error":"#N/A"},0,0,0]
[20,null,null,null,null,null,null,{"$f":"IFERROR(INDEX(DefaultUnits,MATCH(F27,EquipmentTypes,0),1),\"\")","v":""},null,null,null,null,null,null,null,null,null,{"$f":"IFERROR(INDEX(DefaultUnits,MATCH(P27,EquipmentTypes,0),1),\"\")","v":""},null,"",null,null,"","",null,null,null,null,{"$f":"IFERROR(INDEX(DefaultUnits,MATCH(P27,EquipmentTypes,0),3),\"\")","v":""},null,"",null,null,null,null,null,null,null,null,0,0,0,{"$f":"IFERROR(IF($AR$3<'Utility Admin'!$I$2,AR27,'Utility Admin'!$I$2/Inventory!$AR$3*AR27),0)","v":0},0,{"$f":"IFERROR(ProjectCost-SUM(AS28:AS51),0)","v":0},null,"","","","","",null,0,0,0,"UNITS","",0,{"$f":"IF('Project Info'!$D$7=\"TX\",INDEX(EFLH!$AB$4:$AB$30,MATCH(C27,TX_EFLHSanAntonio[Building Type],0),1),'Project Info'!$D$7&\"EquipmentType\")","v":"EquipmentType"},0,0,{"$f":"IF(IFERROR(SEARCH(\"Terminal\",F27,1)>0,FALSE),\"\",HLOOKUP(BI27,'Equipment Lookups'!$L$4:$AB$46,VLOOKUP(Inventory!BL27,'Equipment Lookups'!$J$5:$K$46,2,FALSE),TRUE))","v":{"$error":"#N/A"}},{"$f":"IF(L27=\"Unknown\",YEAR(TODAY())-INDEX('Equipment Lookups'!$AC$5:$AC$38,MATCH(Inventory!BL27,'Equipment Lookups'!$J$5:$J$38,0)),L27)","v":0},"",{"$error":"#N/A"},0,0,0,{"$f":"IF(IFERROR(SEARCH(\"Terminal\",P27,1)>0,FALSE),\"\",HLOOKUP(BO27,'Equipment Lookups'!$L$4:$AB$46,VLOOKUP(Inventory!BR27,'Equipment Lookups'!$J$5:$K$46,2,FALSE),TRUE))","v":{"$error":"#N/A"}},"",{"$error":"#N/A"},{"$f":"INDEX('Equipment Lookups'!$AD$5:$AD$46,MATCH(Inventory!BR27,'Equipment Lookups'!$J$5:$J$46,0))","v":{"$error":"#N/A"}},{"$f":"IFERROR(IF(AL27<>\"\",AL27,IF(State=\"TX\",INDEX(TX_EFLHSanAntonio[[CFAir Cooled Chiller]:[CFPTRoom]],MATCH(Inventory!C27,TX_EFLHSanAntonio[Building Type],0),MATCH(BT27,EFLH!$N$2:$Q$2,0)),VLOOKUP(C27,INDIRECT($BX$5),4,FALSE))),\"-\")","v":"-"},{"$f":"IFERROR(IF(AJ27<>\"\",AJ27,IF(State=\"TX\",INDEX(TX_EFLHSanAntonio[[EFLHcAir Cooled Chiller]:[EFLHcPTRoom]],MATCH(Inventory!C27,TX_EFLHSanAntonio[Building Type],0),MATCH(BT27,EFLH!$V$2:$Y$2,0)),VLOOKUP(C27,INDIRECT($BX$5),2,FALSE))),\"-\")","v":"-"},{"$f":"IFERROR(IF(AK27<>\"\",AK27,IF(State=\"TX\",INDEX(TX_EFLHSanAntonio[[EFLHhDX]:[EFLHhPTRoom]],MATCH(Inventory!C27,TX_EFLHSanAntonio[Building Type],0),MATCH(BT27,EFLH!$Z$2:$AA$2,0)),VLOOKUP(C27,INDIRECT($BX$5),3,FALSE))),\"-\")","v":"-"},{"$f":"IF(AM27<>\"\",AM27,IF(State=\"TX\",INDEX(TX_EFLHSanAntonio[[NCPAir Cooled Chiller]:[NCPPTRoom]],MATCH(Inventory!C27,TX_EFLHSanAntonio[Building Type],0),MATCH(BT27,EFLH!$R$2:$U$2,0)),0))","v":0},1,{"$error":"#N/A"},{"$error":"#N/A"},"",{"$f":"IF(AG27<>\"\",AG27,IF(IFERROR(SEARCH(\"Terminal\",P27,1)>0,FALSE),INDEX(INDIRECT(BS27),A27,MATCH(TRM,PTAC!$AC$9:$AE$9,0)),INDEX(INDIRECT(BS27),MATCH(TRM,BaselineRow,0),1)))","v":{"$error":"#N/A"}},{"$error":"#N/A"},{"$f":"IF(AI27<>\"\",12/3.412/AI27,IF(IFERROR(SEARCH(\"Heat\",P27,1)>0,FALSE),IF(IFERROR(SEARCH(\"Terminal\",P27,1)>0,FALSE),INDEX(INDIRECT(BS27),A27,3+MATCH(TRM,PTAC!$AC$9:$AE$9,0)),INDEX(INDIRECT(BS27),MATCH(TRM,BaselineRow,0),3)),\"\"))","v":""},{"$f":"IF(AG27<>\"\",AG27,IF(IFERROR(SEARCH(\"Terminal\",P27,1)>0,FALSE),INDEX(INDIRECT(BS27),A27,MATCH(TRM,PTAC!$AC$9:$AE$9,0)),INDEX(INDIRECT(BS27),MATCH(TRM,BaselineRow,0),1)))","v":{"$error":"#N/A"}},{"$error":"#N/A"},{"$f":"IF(AI27<>\"\",12/3.412/AI27,IF(IFERROR(SEARCH(\"Heat\",P27,1)>0,FALSE),IF(IFERROR(SEARCH(\"Terminal\",P27,1)>0,FALSE),INDEX(INDIRECT(BS27),A27,3+MATCH(TRM,PTAC!$AC$9:$AE$9,0)),INDEX(INDIRECT(BS27),MATCH(TRM,BaselineRow,0),3)),\"\"))","v":""},"","","",{"$error":"#N/A"},{"$error":"#N/A"},{"$error":"#N/A"},0,{"$error":"#N/A"},{"$error":"#N/A"},{"$error":"#N/A"},{"$error":"#VALUE!"},{"$error":"#N/A"},{"$error":"#N/A"},{"$error":"#N/A"},{"$error":"#VALUE!"},0,0,0,0,{"$f":"INDEX('Utility Admin'!$P$2:$AD$2,1,MATCH($P27,'Utility Admin'!$P$3:$AD$3,0))","v":{"$error":"#N/A"}},{"$f":"INDEX('Utility Admin'!AE$2:AS$2,1,MATCH($P27,'Utility Admin'!$P$3:$AD$3,0))","v":{"$error":"#N/A"}},{"$f":"IF(kWhOverride=\"\",INDEX('Utility Admin'!$AT$2:$BH$2,1,MATCH($P27,'Utility Admin'!$P$3:$AD$3,0)),kWhOverride)","v":{"$error":"#N/A"}},"",{"$f":"INDEX('Equipment Lookups'!$AF$5:$BS$46,MATCH(Inventory!BL27,'Equipment Lookups'!$J$5:$J$46,0),MATCH(Inventory!DE27,'Equipment Lookups'!$AF$4:$BS$4,0))","v":{"$error":"#N/A"}},{"$f":"INDEX('Equipment Lookups'!$AE$5:$AE$46,MATCH(Inventory!BR27,'Equipment Lookups'!$J$5:$J$46,0))","v":{"$error":"#N/A"}},{"$error":"#N/A"},{"$error":"#N/A"},{"$error":"#N/A"},{"$error":"#N/A"},{"$error":"#N/A"},{"$error":"#N/A"},{"$error":"#N/A"},{"$error":"#N/A"},{"$error":"#N/A"},{"$error":"#N/A"},{"$error":"#N/A"},{"$error":"#N/A"},{"$error":"#N/A"},{"$error":"#N/A"},{"$error":"#N/A"},{"$error":"#N/A"},{"$error":"#N/A"},{"$error":"#N/A"},{"$error":"#N/A"},0,0,0]
[21,null,null,null,null,null,null,{"$f":"IFERROR(INDEX(DefaultUnits,MATCH(F28,EquipmentTypes,0),1),\"\")","v":""},null,null,null,null,null,null,null,null,null,{"$f":"IFERROR(INDEX(DefaultUnits,MATCH(P28,EquipmentTypes,0),1),\"\")","v":""},null,"",null,null,"","",null,null,null,null,{"$f":"IFERROR(INDEX(DefaultUnits,MATCH(P28,EquipmentTypes,0),3),\"\")","v":""},null,"",null,null,null,null,null,null,null,null,0,0,0,{"$f":"IFERROR(IF($AR$3<'Utility Admin'!$I$2,AR28,'Utility Admin'!$I$2/Inventory!$AR$3*AR28),0)","v":0},0,{"$f":"IFERROR(ProjectCost-SUM(AS29:AS52),0)","v":0},null,"","","","","",null,0,0,0,"UNITS","",0,{"$f":"IF('Project Info'!$D$7=\"TX\",INDEX(EFLH!$AB$4:$AB$30,MATCH(C28,TX_EFLHSanAntonio[Building Type],0),1),'Project Info'!$D$7&\"EquipmentType\")","v":"EquipmentType"},0,0,{"$f":"IF(IFERROR(SEARCH(\"Terminal\",F28,1)>0,FALSE),\"\",HLOOKUP(BI28,'Equipment Lookups'!$L$4:$AB$46,VLOOKUP(Inventory!BL28,'Equipment Lookups'!$J$5:$K$46,2,FALSE),TRUE))","v":{"$error":"#N/A"}},{"$f":"IF(L28=\"Unknown\",YEAR(TODAY())-INDEX('Equipment Lookups'!$AC$5:$AC$38,MATCH(Inventory!BL28,'Equipment Lookups'!$J$5:$J$38,0)),L28)","v":0},"",{"$error":"#N/A"},0,0,0,{"$f":"IF(IFERROR(SEARCH(\"Terminal\",P28,1)>0,FALSE),\"\",HLOOKUP(BO28,'Equipment Lookups'!$L$4:$AB$46,VLOOKUP(Inventory!BR28,'Equipment Lookups'!$J$5:$K$46,2,FALSE),TRUE))","v":{"$error":"#N/A"}},"",{"$error":"#N/A"},{"$f":"INDEX('Equipment Lookups'!$AD$5:$AD$46,MATCH(Inventory!BR28,'Equipment Lookups'!$J$5:$J$46,0))","v":{"$error":"#N/A"}},{"$f":"IFERROR(IF(AL28<>\"\",AL28,IF(State=\"TX\",INDEX(TX_EFLHSanAntonio[[CFAir Cooled Chiller]:[CFPTRoom]],MATCH(Inventory!C28,TX_EFLHSanAntonio[Building Type],0),MATCH(BT28,EFLH!$N$2:$Q$2,0)),VLOOKUP(C28,INDIRECT($BX$5),4,FALSE))),\"-\")","v":"-"},{"$f":"IFERROR(IF(AJ28<>\"\",AJ28,IF(State=\"TX\",INDEX(TX_EFLHSanAntonio[[EFLHcAir Cooled Chiller]:[EFLHcPTRoom]],MATCH(Inventory!C28,TX_EFLHSanAntonio[Building Type],0),MATCH(BT28,EFLH!$V$2:$Y$2,0)),VLOOKUP(C28,INDIRECT($BX$5),2,FALSE))),\"-\")","v":"-"},{"$f":"IFERROR(IF(AK28<>\"\",AK28,IF(State=\"TX\",INDEX(TX_EFLHSanAntonio[[EFLHhDX]:[EFLHhPTRoom]],MATCH(Inventory!C28,TX_EFLHSanAntonio[Building Type],0),MATCH(BT28,EFLH!$Z$2:$AA$2,0)),VLOOKUP(C28,INDIRECT($BX$5),3,FALSE))),\"-\")","v":"-"},{"$f":"IF(AM28<>\"\",AM28,IF(State=\"TX\",INDEX(TX_EFLHSanAntonio[[NCPAir Cooled Chiller]:[NCPPTRoom]],MATCH(Inventory!C28,TX_EFLHSanAntonio[Building Type],0),MATCH(BT28,EFLH!$R$2:$U$2,0)),0))","v":0},1,{"$error":"#N/A"},{"$error":"#N/A"},"",{"$f":"IF(AG28<>\"\",AG28,IF(IFERROR(SEARCH(\"Terminal\",P28,1)>0,FALSE),INDEX(INDIRECT(BS28),A28,MATCH(TRM,PTAC!$AC$9:$AE$9,0)),INDEX(INDIRECT(BS28),MATCH(TRM,BaselineRow,0),1)))","v":{"$error":"#N/A"}},{"$error":"#N/A"},{"$f":"IF(AI28<>\"\",12/3.412/AI28,IF(IFERROR(SEARCH(\"Heat\",P28,1)>0,FALSE),IF(IFERROR(SEARCH(\"Terminal\",P28,1)>0,FALSE),INDEX(INDIRECT(BS28),A28,3+MATCH(TRM,PTAC!$AC$9:$AE$9,0)),INDEX(INDIRECT(BS28),MATCH(TRM,BaselineRow,0),3)),\"\"))","v":""},{"$f":"IF(AG28<>\"\",AG28,IF(IFERROR(SEARCH(\"Terminal\",P28,1)>0,FALSE),INDEX(INDIRECT(BS28),A28,MATCH(TRM,PTAC!$AC$9:$AE$9,0)),INDEX(INDIRECT(BS28),MATCH(TRM,BaselineRow,0),1)))","v":{"$error":"#N/A"}},{"$error":"#N/A"},{"$f":"IF(AI28<>\"\",12/3.412/AI28,IF(IFERROR(SEARCH(\"Heat\",P28,1)>0,FALSE),IF(IFERROR(SEARCH(\"Terminal\",P28,1)>0,FALSE),INDEX(INDIRECT(BS28),A28,3+MATCH(TRM,PTAC!$AC$9:$AE$9,0)),INDEX(INDIRECT(BS28),MATCH(TRM,BaselineRow,0),3)),\"\"))","v":""},"","","",{"$error":"#N/A"},{"$error":"#N/A"},{"$error":"#N/A"},0,{"$error":"#N/A"},{"$error":"#N/A"},{"$error":"#N/A"},{"$error":"#VALUE!"},{"$error":"#N/A"},{"$error":"#N/A"},{"$error":"#N/A"},{"$error":"#VALUE!"},0,0,0,0,{"$f":"INDEX('Utility Admin'!$P$2:$AD$2,1,MATCH($P28,'Utility Admin'!$P$3:$AD$3,0))","v":{"$error":"#N/A"}},{"$f":"INDEX('Utility Admin'!AE$2:AS$2,1,MATCH($P28,'Utility Admin'!$P$3:$AD$3,0))","v":{"$error":"#N/A"}},{"$f":"IF(kWhOverride=\"\",INDEX('Utility Admin'!$AT$2:$BH$2,1,MATCH($P28,'Utility Admin'!$P$3:$AD$3,0)),kWhOverride)","v":{"$error":"#N/A"}},"",{"$f":"INDEX('Equipment Lookups'!$AF$5:$BS$46,MATCH(Inventory!BL28,'Equipment Lookups'!$J$5:$J$46,0),MATCH(Inventory!DE28,'Equipment Lookups'!$AF$4:$BS$4,0))","v":{"$error":"#N/A"}},{"$f":"INDEX('Equipment Lookups'!$AE$5:$AE$46,MATCH(Inventory!BR28,'Equipment Lookups'!$J$5:$J$46,0))","v":{"$error":"#N/A"}},{"$error":"#N/A"},{"$error":"#N/A"},{"$error":"#N/A"},{"$error":"#N/A"},{"$error":"#N/A"},{"$error":"#N/A"},{"$error":"#N/A"},{"$error":"#N/A"},{"$error":"#N/A"},{"$error":"#N/A"},{"$error":"#N/A"},{"$error":"#N/A"},{"$error":"#N/A"},{"$error":"#N/A"},{"$error":"#N/A"},{"$error":"#N/A"},{"$error":"#N/A"},{"$error":"#N/A"},{"$error":"#N/A"},0,0,0]
[22,null,null,null,null,null,null,{"$f":"IFERROR(INDEX(DefaultUnits,MATCH(F29,EquipmentTypes,0),1),\"\")","v":""},null,null,null,null,null,null,null,null,null,{"$f":"IFERROR(INDEX(DefaultUnits,MATCH(P29,EquipmentTypes,0),1),\"\")","v":""},null,"",null,null,"","",null,null,null,null,{"$f":"IFERROR(INDEX(DefaultUnits,MATCH(P29,EquipmentTypes,0),3),\"\")","v":""},null,"",null,null,null,null,null,null,null,null,0,0,0,{"$f":"IFERROR(IF($AR$3<'Utility Admin'!$I$2,AR29,'Utility Admin'!$I$2/Inventory!$AR$3*AR29),0)","v":0},0,{"$f":"IFERROR(ProjectCost-SUM(AS30:AS53),0)","v":0},null,"","","","","",null,0,0,0,"UNITS","",0,{"$f":"IF('Project Info'!$D$7=\"TX\",INDEX(EFLH!$AB$4:$AB$30,MATCH(C29,TX_EFLHSanAntonio[Building Type],0),1),'Project Info'!$D$7&\"EquipmentType\")","v":"EquipmentType"},0,0,{"$f":"IF(IFERROR(SEARCH(\"Terminal\",F29,1)>0,FALSE),\"\",HLOOKUP(BI29,'Equipment Lookups'!$L$4:$AB$46,VLOOKUP(Inventory!BL29,'Equipment Lookups'!$J$5:$K$46,2,FALSE),TRUE))","v":{"$error":"#N/A"}},{"$f":"IF(L29=\"Unknown\",YEAR(TODAY())-INDEX('Equipment Lookups'!$AC$5:$AC$38,MATCH(Inventory!BL29,'Equipment Lookups'!$J$5:$J$38,0)),L29)","v":0},"",{"$error":"#N/A"},0,0,0,{"$f":"IF(IFERROR(SEARCH(\"Terminal\",P29,1)>0,FALSE),\"\",HLOOKUP(BO29,'Equipment Lookups'!$L$4:$AB$46,VLOOKUP(Inventory!BR29,'Equipment Lookups'!$J$5:$K$46,2,FALSE),TRUE))","v":{"$error":"#N/A"}},"",{"$error":"#N/A"},{"$f":"INDEX('Equipment Lookups'!$AD$5:$AD$46,MATCH(Inventory!BR29,'Equipment Lookups'!$J$5:$J$46,0))","v":{"$error":"#N/A"}},{"$f":"IFERROR(IF(AL29<>\"\",AL29,IF(State=\"TX\",INDEX(TX_EFLHSanAntonio[[CFAir Cooled Chiller]:[CFPTRoom]],MATCH(Inventory!C29,TX_EFLHSanAntonio[Building Type],0),MATCH(BT29,EFLH!$N$2:$Q$2,0)),VLOOKUP(C29,INDIRECT($BX$5),4,FALSE))),\"-\")","v":"-"},{"$f":"IFERROR(IF(AJ29<>\"\",AJ29,IF(State=\"TX\",INDEX(TX_EFLHSanAntonio[[EFLHcAir Cooled Chiller]:[EFLHcPTRoom]],MATCH(Inventory!C29,TX_EFLHSanAntonio[Building Type],0),MATCH(BT29,EFLH!$V$2:$Y$2,0)),VLOOKUP(C29,INDIRECT($BX$5),2,FALSE))),\"-\")","v":"-"},{"$f":"IFERROR(IF(AK29<>\"\",AK29,IF(State=\"TX\",INDEX(TX_EFLHSanAntonio[[EFLHhDX]:[EFLHhPTRoom]],MATCH(Inventory!C29,TX_EFLHSanAntonio[Building Type],0),MATCH(BT29,EFLH!$Z$2:$AA$2,0)),VLOOKUP(C29,INDIRECT($BX$5),3,FALSE))),\"-\")","v":"-"},{"$f":"IF(AM29<>\"\",AM29,IF(State=\"TX\",INDEX(TX_EFLHSanAntonio[[NCPAir Cooled Chiller]:[NCPPTRoom]],MATCH(Inventory!C29,TX_EFLHSanAntonio[Building Type],0),MATCH(BT29,EFLH!$R$2:$U$2,0)),0))","v":0},1,{"$error":"#N/A"},{"$error":"#N/A"},"",{"$f":"IF(AG29<>\"\",AG29,IF(IFERROR(SEARCH(\"Terminal\",P29,1)>0,FALSE),INDEX(INDIRECT(BS29),A29,MATCH(TRM,PTAC!$AC$9:$AE$9,0)),INDEX(INDIRECT(BS29),MATCH(TRM,BaselineRow,0),1)))","v":{"$error":"#N/A"}},{"$error":"#N/A"},{"$f":"IF(AI29<>\"\",12/3.412/AI29,IF(IFERROR(SEARCH(\"Heat\",P29,1)>0,FALSE),IF(IFERROR(SEARCH(\"Terminal\",P29,1)>0,FALSE),INDEX(INDIRECT(BS29),A29,3+MATCH(TRM,PTAC!$AC$9:$AE$9,0)),INDEX(INDIRECT(BS29),MATCH(TRM,BaselineRow,0),3)),\"\"))","v":""},{"$f":"IF(AG29<>\"\",AG29,IF(IFERROR(SEARCH(\"Terminal\",P29,1)>0,FALSE),INDEX(INDIRECT(BS29),A29,MATCH(TRM,PTAC!$AC$9:$AE$9,0)),INDEX(INDIRECT(BS29),MATCH(TRM,BaselineRow,0),1)))","v":{"$error":"#N/A"}},{"$error":"#N/A"},{"$f":"IF(AI29<>\"\",12/3.412/AI29,IF(IFERROR(SEARCH(\"Heat\",P29,1)>0,FALSE),IF(IFERROR(SEARCH(\"Terminal\",P29,1)>0,FALSE),INDEX(INDIRECT(BS29),A29,3+MATCH(TRM,PTAC!$AC$9:$AE$9,0)),INDEX(INDIRECT(BS29),MATCH(TRM,BaselineRow,0),3)),\"\"))","v":""},"","","",{"$error":"#N/A"},{"$error":"#N/A"},{"$error":"#N/A"},0,{"$error":"#N/A"},{"$error":"#N/A"},{"$error":"#N/A"},{"$error":"#VALUE!"},{"$error":"#N/A"},{"$error":"#N/A"},{"$error":"#N/A"},{"$error":"#VALUE!"},0,0,0,0,{"$f":"INDEX('Utility Admin'!$P$2:$AD$2,1,MATCH($P29,'Utility Admin'!$P$3:$AD$3,0))","v":{"$error":"#N/A"}},{"$f":"INDEX('Utility Admin'!AE$2:AS$2,1,MATCH($P29,'Utility Admin'!$P$3:$AD$3,0))","v":{"$error":"#N/A"}},{"$f":"IF(kWhOverride=\"\",INDEX('Utility Admin'!$AT$2:$BH$2,1,MATCH($P29,'Utility Admin'!$P$3:$AD$3,0)),kWhOverride)","v":{"$error":"#N/A"}},"",{"$f":"INDEX('Equipment Lookups'!$AF$5:$BS$46,MATCH(Inventory!BL29,'Equipment Lookups'!$J$5:$J$46,0),MATCH(Inventory!DE29,'Equipment Lookups'!$AF$4:$BS$4,0))","v":{"$error":"#N/A"}},{"$f":"INDEX('Equipment Lookups'!$AE$5:$AE$46,MATCH(Inventory!BR29,'Equipment Lookups'!$J$5:$J$46,0))","v":{"$error":"#N/A"}},{"$error":"#N/A"},{"$error":"#N/A"},{"$error":"#N/A"},{"$error":"#N/A"},{"$error":"#N/A"},{"$error":"#N/A"},{"$error":"#N/A"},{"$error":"#N/A"},{"$error":"#N/A"},{"$error":"#N/A"},{"$error":"#N/A"},{"$error":"#N/A"},{"$error":"#N/A"},{"$error":"#N/A"},{"$error":"#N/A"},{"$error":"#N/A"},{"$error":"#N/A"},{"$error":"#N/A"},{"$error":"#N/A"},0,0,0]
[23,null,null,null,null,null,null,{"$f":"IFERROR(INDEX(DefaultUnits,MATCH(F30,EquipmentTypes,0),1),\"\")","v":""},null,null,null,null,null,null,null,null,null,{"$f":"IFERROR(INDEX(DefaultUnits,MATCH(P30,EquipmentTypes,0),1),\"\")","v":""},null,"",null,null,"","",null,null,null,null,{"$f":"IFERROR(INDEX(DefaultUnits,MATCH(P30,EquipmentTypes,0),3),\"\")","v":""},null,"",null,null,null,null,null,null,null,null,0,0,0,{"$f":"IFERROR(IF($AR$3<'Utility Admin'!$I$2,AR30,'Utility Admin'!$I$2/Inventory!$AR$3*AR30),0)","v":0},0,{"$f":"IFERROR(ProjectCost-SUM(AS31:AS54),0)","v":0},null,"","","","","",null,0,0,0,"UNITS","",0,{"$f":"IF('Project Info'!$D$7=\"TX\",INDEX(EFLH!$AB$4:$AB$30,MATCH(C30,TX_EFLHSanAntonio[Building Type],0),1),'Project Info'!$D$7&\"EquipmentType\")","v":"EquipmentType"},0,0,{"$f":"IF(IFERROR(SEARCH(\"Terminal\",F30,1)>0,FALSE),\"\",HLOOKUP(BI30,'Equipment Lookups'!$L$4:$AB$46,VLOOKUP(Inventory!BL30,'Equipment Lookups'!$J$5:$K$46,2,FALSE),TRUE))","v":{"$error":"#N/A"}},{"$f":"IF(L30=\"Unknown\",YEAR(TODAY())-INDEX('Equipment Lookups'!$AC$5:$AC$38,MATCH(Inventory!BL30,'Equipment Lookups'!$J$5:$J$38,0)),L30)","v":0},"",{"$error":"#N/A"},0,0,0,{"$f":"IF(IFERROR(SEARCH(\"Terminal\",P30,1)>0,FALSE),\"\",HLOOKUP(BO30,'Equipment Lookups'!$L$4:$AB$46,VLOOKUP(Inventory!BR30,'Equipment Lookups'!$J$5:$K$46,2,FALSE),TRUE))","v":{"$error":"#N/A"}},"",{"$error":"#N/A"},{"$f":"INDEX('Equipment Lookups'!$AD$5:$AD$46,MATCH(Inventory!BR30,'Equipment Lookups'!$J$5:$J$46,0))","v":{"$error":"#N/A"}},{"$f":"IFERROR(IF(AL30<>\"\",AL30,IF(State=\"TX\",INDEX(TX_EFLHSanAntonio[[CFAir Cooled Chiller]:[CFPTRoom]],MATCH(Inventory!C30,TX_EFLHSanAntonio[Building Type],0),MATCH(BT30,EFLH!$N$2:$Q$2,0)),VLOOKUP(C30,INDIRECT($BX$5),4,FALSE))),\"-\")","v":"-"},{"$f":"IFERROR(IF(AJ30<>\"\",AJ30,IF(State=\"TX\",INDEX(TX_EFLHSanAntonio[[EFLHcAir Cooled Chiller]:[EFLHcPTRoom]],MATCH(Inventory!C30,TX_EFLHSanAntonio[Building Type],0),MATCH(BT30,EFLH!$V$2:$Y$2,0)),VLOOKUP(C30,INDIRECT($BX$5),2,FALSE))),\"-\")","v":"-"},{"$f":"IFERROR(IF(AK30<>\"\",AK30,IF(State=\"TX\",INDEX(TX_EFLHSanAntonio[[EFLHhDX]:[EFLHhPTRoom]],MATCH(Inventory!C30,TX_EFLHSanAntonio[Building Type],0),MATCH(BT30,EFLH!$Z$2:$AA$2,0)),VLOOKUP(C30,INDIRECT($BX$5),3,FALSE))),\"-\")","v":"-"},{"$f":"IF(AM30<>\"\",AM30,IF(State=\"TX\",INDEX(TX_EFLHSanAntonio[[NCPAir Cooled Chiller]:[NCPPTRoom]],MATCH(Inventory!C30,TX_EFLHSanAntonio[Building Type],0),MATCH(BT30,EFLH!$R$2:$U$2,0)),0))","v":0},1,{"$error":"#N/A"},{"$error":"#N/A"},"",{"$f":"IF(AG30<>\"\",AG30,IF(IFERROR(SEARCH(\"Terminal\",P30,1)>0,FALSE),INDEX(INDIRECT(BS30),A30,MATCH(TRM,PTAC!$AC$9:$AE$9,0)),INDEX(INDIRECT(BS30),MATCH(TRM,BaselineRow,0),1)))","v":{"$error":"#N/A"}},{"$error":"#N/A"},{"$f":"IF(AI30<>\"\",12/3.412/AI30,IF(IFERROR(SEARCH(\"Heat\",P30,1)>0,FALSE),IF(IFERROR(SEARCH(\"Terminal\",P30,1)>0,FALSE),INDEX(INDIRECT(BS30),A30,3+MATCH(TRM,PTAC!$AC$9:$AE$9,0)),INDEX(INDIRECT(BS30),MATCH(TRM,BaselineRow,0),3)),\"\"))","v":""},{"$f":"IF(AG30<>\"\",AG30,IF(IFERROR(SEARCH(\"Terminal\",P30,1)>0,FALSE),INDEX(INDIRECT(BS30),A30,MATCH(TRM,PTAC!$AC$9:$AE$9,0)),INDEX(INDIRECT(BS30),MATCH(TRM,BaselineRow,0),1)))","v":{"$error":"#N/A"}},{"$error":"#N/A"},{"$f":"IF(AI30<>\"\",12/3.412/AI30,IF(IFERROR(SEARCH(\"Heat\",P30,1)>0,FALSE),IF(IFERROR(SEARCH(\"Terminal\",P30,1)>0,FALSE),INDEX(INDIRECT(BS30),A30,3+MATCH(TRM,PTAC!$AC$9:$AE$9,0)),INDEX(INDIRECT(BS30),MATCH(TRM,BaselineRow,0),3)),\"\"))","v":""},"","","",{"$error":"#N/A"},{"$error":"#N/A"},{"$error":"#N/A"},0,{"$error":"#N/A"},{"$error":"#N/A"},{"$error":"#N/A"},{"$error":"#VALUE!"},{"$error":"#N/A"},{"$error":"#N/A"},{"$error":"#N/A"},{"$error":"#VALUE!"},0,0,0,0,{"$f":"INDEX('Utility Admin'!$P$2:$AD$2,1,MATCH($P30,'Utility Admin'!$P$3:$AD$3,0))","v":{"$error":"#N/A"}},{"$f":"INDEX('Utility Admin'!AE$2:AS$2,1,MATCH($P30,'Utility Admin'!$P$3:$AD$3,0))","v":{"$error":"#N/A"}},{"$f":"IF(kWhOverride=\"\",INDEX('Utility Admin'!$AT$2:$BH$2,1,MATCH($P30,'Utility Admin'!$P$3:$AD$3,0)),kWhOverride)","v":{"$error":"#N/A"}},"",{"$f":"INDEX('Equipment Lookups'!$AF$5:$BS$46,MATCH(Inventory!BL30,'Equipment Lookups'!$J$5:$J$46,0),MATCH(Inventory!DE30,'Equipment Lookups'!$AF$4:$BS$4,0))","v":{"$error":"#N/A"}},{"$f":"INDEX('Equipment Lookups'!$AE$5:$AE$46,MATCH(Inventory!BR30,'Equipment Lookups'!$J$5:$J$46,0))","v":{"$error":"#N/A"}},{"$error":"#N/A"},{"$error":"#N/A"},{"$error":"#N/A"},{"$error":"#N/A"},{"$error":"#N/A"},{"$error":"#N/A"},{"$error":"#N/A"},{"$error":"#N/A"},{"$error":"#N/A"},{"$error":"#N/A"},{"$error":"#N/A"},{"$error":"#N/A"},{"$error":"#N/A"},{"$error":"#N/A"},{"$error":"#N/A"},{"$error":"#N/A"},{"$error":"#N/A"},{"$error":"#N/A"},{"$error":"#N/A"},0,0,0]
[24,null,null,null,null,null,null,{"$f":"IFERROR(INDEX(DefaultUnits,MATCH(F31,EquipmentTypes,0),1),\"\")","v":""},null,null,null,null,null,null,null,null,null,{"$f":"IFERROR(INDEX(DefaultUnits,MATCH(P31,EquipmentTypes,0),1),\"\")","v":""},null,"",null,null,"","",null,null,null,null,{"$f":"IFERROR(INDEX(DefaultUnits,MATCH(P31,EquipmentTypes,0),3),\"\")","v":""},null,"",null,null,null,null,null,null,null,null,0,0,0,{"$f":"IFERROR(IF($AR$3<'Utility Admin'!$I$2,AR31,'Utility Admin'!$I$2/Inventory!$AR$3*AR31),0)","v":0},0,{"$f":"IFERROR(ProjectCost-SUM(AS32:AS55),0)","v":0},null,"","","","","",null,0,0,0,"UNITS","",0,{"$f":"IF('Project Info'!$D$7=\"TX\",INDEX(EFLH!$AB$4:$AB$30,MATCH(C31,TX_EFLHSanAntonio[Building Type],0),1),'Project Info'!$D$7&\"EquipmentType\")","v":"EquipmentType"},0,0,{"$f":"IF(IFERROR(SEARCH(\"Terminal\",F31,1)>0,FALSE),\"\",HLOOKUP(BI31,'Equipment Lookups'!$L$4:$AB$46,VLOOKUP(Inventory!BL31,'Equipment Lookups'!$J$5:$K$46,2,FALSE),TRUE))","v":{"$error":"#N/A"}},{"$f":"IF(L31=\"Unknown\",YEAR(TODAY())-INDEX('Equipment Lookups'!$AC$5:$AC$38,MATCH(Inventory!BL31,'Equipment Lookups'!$J$5:$J$38,0)),L31)","v":0},"",{"$error":"#N/A"},0,0,0,{"$f":"IF(IFERROR(SEARCH(\"Terminal\",P31,1)>0,FALSE),\"\",HLOOKUP(BO31,'Equipment Lookups'!$L$4:$AB$46,VLOOKUP(Inventory!BR31,'Equipment Lookups'!$J$5:$K$46,2,FALSE),TRUE))","v":{"$error":"#N/A"}},"",{"$error":"#N/A"},{"$f":"INDEX('Equipment Lookups'!$AD$5:$AD$46,MATCH(Inventory!BR31,'Equipment Lookups'!$J$5:$J$46,0))","v":{"$error":"#N/A"}},{"$f":"IFERROR(IF(AL31<>\"\",AL31,IF(State=\"TX\",INDEX(TX_EFLHSanAntonio[[CFAir Cooled Chiller]:[CFPTRoom]],MATCH(Inventory!C31,TX_EFLHSanAntonio[Building Type],0),MATCH(BT31,EFLH!$N$2:$Q$2,0)),VLOOKUP(C31,INDIRECT($BX$5),4,FALSE))),\"-\")","v":"-"},{"$f":"IFERROR(IF(AJ31<>\"\",AJ31,IF(State=\"TX\",INDEX(TX_EFLHSanAntonio[[EFLHcAir Cooled Chiller]:[EFLHcPTRoom]],MATCH(Inventory!C31,TX_EFLHSanAntonio[Building Type],0),MATCH(BT31,EFLH!$V$2:$Y$2,0)),VLOOKUP(C31,INDIRECT($BX$5),2,FALSE))),\"-\")","v":"-"},{"$f":"IFERROR(IF(AK31<>\"\",AK31,IF(State=\"TX\",INDEX(TX_EFLHSanAntonio[[EFLHhDX]:[EFLHhPTRoom]],MATCH(Inventory!C31,TX_EFLHSanAntonio[Building Type],0),MATCH(BT31,EFLH!$Z$2:$AA$2,0)),VLOOKUP(C31,INDIRECT($BX$5),3,FALSE))),\"-\")","v":"-"},{"$f":"IF(AM31<>\"\",AM31,IF(State=\"TX\",INDEX(TX_EFLHSanAntonio[[NCPAir Cooled Chiller]:[NCPPTRoom]],MATCH(Inventory!C31,TX_EFLHSanAntonio[Building Type],0),MATCH(BT31,EFLH!$R$2:$U$2,0)),0))","v":0},1,{"$error":"#N/A"},{"$error":"#N/A"},"",{"$f":"IF(AG31<>\"\",AG31,IF(IFERROR(SEARCH(\"Terminal\",P31,1)>0,FALSE),INDEX(INDIRECT(BS31),A31,MATCH(TRM,PTAC!$AC$9:$AE$9,0)),INDEX(INDIRECT(BS31),MATCH(TRM,BaselineRow,0),1)))","v":{"$error":"#N/A"}},{"$error":"#N/A"},{"$f":"IF(AI31<>\"\",12/3.412/AI31,IF(IFERROR(SEARCH(\"Heat\",P31,1)>0,FALSE),IF(IFERROR(SEARCH(\"Terminal\",P31,1)>0,FALSE),INDEX(INDIRECT(BS31),A31,3+MATCH(TRM,PTAC!$AC$9:$AE$9,0)),INDEX(INDIRECT(BS31),MATCH(TRM,BaselineRow,0),3)),\"\"))","v":""},{"$f":"IF(AG31<>\"\",AG31,IF(IFERROR(SEARCH(\"Terminal\",P31,1)>0,FALSE),INDEX(INDIRECT(BS31),A31,MATCH(TRM,PTAC!$AC$9:$AE$9,0)),INDEX(INDIRECT(BS31),MATCH(TRM,BaselineRow,0),1)))","v":{"$error":"#N/A"}},{"$error":"#N/A"},{"$f":"IF(AI31<>\"\",12/3.412/AI31,IF(IFERROR(SEARCH(\"Heat\",P31,1)>0,FALSE),IF(IFERROR(SEARCH(\"Terminal\",P31,1)>0,FALSE),INDEX(INDIRECT(BS31),A31,3+MATCH(TRM,PTAC!$AC$9:$AE$9,0)),INDEX(INDIRECT(BS31),MATCH(TRM,BaselineRow,0),3)),\"\"))","v":""},"","","",{"$error":"#N/A"},{"$error":"#N/A"},{"$error":"#N/A"},0,{"$error":"#N/A"},{"$error":"#N/A"},{"$error":"#N/A"},{"$error":"#VALUE!"},{"$error":"#N/A"},{"$error":"#N/A"},{"$error":"#N/A"},{"$error":"#VALUE!"},0,0,0,0,{"$f":"INDEX('Utility Admin'!$P$2:$AD$2,1,MATCH($P31,'Utility Admin'!$P$3:$AD$3,0))","v":{"$error":"#N/A"}},{"$f":"INDEX('Utility Admin'!AE$2:AS$2,1,MATCH($P31,'Utility Admin'!$P$3:$AD$3,0))","v":{"$error":"#N/A"}},{"$f":"IF(kWhOverride=\"\",INDEX('Utility Admin'!$AT$2:$BH$2,1,MATCH($P31,'Utility Admin'!$P$3:$AD$3,0)),kWhOverride)","v":{"$error":"#N/A"}},"",{"$f":"INDEX('Equipment Lookups'!$AF$5:$BS$46,MATCH(Inventory!BL31,'Equipment Lookups'!$J$5:$J$46,0),MATCH(Inventory!DE31,'Equipment Lookups'!$AF$4:$BS$4,0))","v":{"$error":"#N/A"}},{"$f":"INDEX('Equipment Lookups'!$AE$5:$AE$46,MATCH(Inventory!BR31,'Equipment Lookups'!$J$5:$J$46,0))","v":{"$error":"#N/A"}},{"$error":"#N/A"},{"$error":"#N/A"},{"$error":"#N/A"},{"$error":"#N/A"},{"$error":"#N/A"},{"$error":"#N/A"},{"$error":"#N/A"},{"$error":"#N/A"},{"$error":"#N/A"},{"$error":"#N/A"},{"$error":"#N/A"},{"$error":"#N/A"},{"$error":"#N/A"},{"$error":"#N/A"},{"$error":"#N/A"},{"$error":"#N/A"},{"$error":"#N/A"},{"$error":"#N/A"},{"$error":"#N/A"},0,0,0]
[25,null,null,null,null,null,null,{"$f":"IFERROR(INDEX(DefaultUnits,MATCH(F32,EquipmentTypes,0),1),\"\")","v":""},null,null,null,null,null,null,null,null,null,{"$f":"IFERROR(INDEX(DefaultUnits,MATCH(P32,EquipmentTypes,0),1),\"\")","v":""},null,"",null,null,"","",null,null,null,null,{"$f":"IFERROR(INDEX(DefaultUnits,MATCH(P32,EquipmentTypes,0),3),\"\")","v":""},null,"",null,null,null,null,null,null,null,null,0,0,0,{"$f":"IFERROR(IF($AR$3<'Utility Admin'!$I$2,AR32,'Utility Admin'!$I$2/Inventory!$AR$3*AR32),0)","v":0},0,{"$f":"IFERROR(ProjectCost-SUM(AS33:AS56),0)","v":0},null,"","","","","",null,0,0,0,"UNITS","",0,{"$f":"IF('Project Info'!$D$7=\"TX\",INDEX(EFLH!$AB$4:$AB$30,MATCH(C32,TX_EFLHSanAntonio[Building Type],0),1),'Project Info'!$D$7&\"EquipmentType\")","v":"EquipmentType"},0,0,{"$f":"IF(IFERROR(SEARCH(\"Terminal\",F32,1)>0,FALSE),\"\",HLOOKUP(BI32,'Equipment Lookups'!$L$4:$AB$46,VLOOKUP(Inventory!BL32,'Equipment Lookups'!$J$5:$K$46,2,FALSE),TRUE))","v":{"$error":"#N/A"}},{"$f":"IF(L32=\"Unknown\",YEAR(TODAY())-INDEX('Equipment Lookups'!$AC$5:$AC$38,MATCH(Inventory!BL32,'Equipment Lookups'!$J$5:$J$38,0)),L32)","v":0},"",{"$error":"#N/A"},0,0,0,{"$f":"IF(IFERROR(SEARCH(\"Terminal\",P32,1)>0,FALSE),\"\",HLOOKUP(BO32,'Equipment Lookups'!$L$4:$AB$46,VLOOKUP(Inventory!BR32,'Equipment Lookups'!$J$5:$K$46,2,FALSE),TRUE))","v":{"$error":"#N/A"}},"",{"$error":"#N/A"},{"$f":"INDEX('Equipment Lookups'!$AD$5:$AD$46,MATCH(Inventory!BR32,'Equipment Lookups'!$J$5:$J$46,0))","v":{"$error":"#N/A"}},{"$f":"IFERROR(IF(AL32<>\"\",AL32,IF(State=\"TX\",INDEX(TX_EFLHSanAntonio[[CFAir Cooled Chiller]:[CFPTRoom]],MATCH(Inventory!C32,TX_EFLHSanAntonio[Building Type],0),MATCH(BT32,EFLH!$N$2:$Q$2,0)),VLOOKUP(C32,INDIRECT($BX$5),4,FALSE))),\"-\")","v":"-"},{"$f":"IFERROR(IF(AJ32<>\"\",AJ32,IF(State=\"TX\",INDEX(TX_EFLHSanAntonio[[EFLHcAir Cooled Chiller]:[EFLHcPTRoom]],MATCH(Inventory!C32,TX_EFLHSanAntonio[Building Type],0),MATCH(BT32,EFLH!$V$2:$Y$2,0)),VLOOKUP(C32,INDIRECT($BX$5),2,FALSE))),\"-\")","v":"-"},{"$f":"IFERROR(IF(AK32<>\"\",AK32,IF(State=\"TX\",INDEX(TX_EFLHSanAntonio[[EFLHhDX]:[EFLHhPTRoom]],MATCH(Inventory!C32,TX_EFLHSanAntonio[Building Type],0),MATCH(BT32,EFLH!$Z$2:$AA$2,0)),VLOOKUP(C32,INDIRECT($BX$5),3,FALSE))),\"-\")","v":"-"},{"$f":"IF(AM32<>\"\",AM32,IF(State=\"TX\",INDEX(TX_EFLHSanAntonio[[NCPAir Cooled Chiller]:[NCPPTRoom]],MATCH(Inventory!C32,TX_EFLHSanAntonio[Building Type],0),MATCH(BT32,EFLH!$R$2:$U$2,0)),0))","v":0},1,{"$error":"#N/A"},{"$error":"#N/A"},"",{"$f":"IF(AG32<>\"\",AG32,IF(IFERROR(SEARCH(\"Terminal\",P32,1)>0,FALSE),INDEX(INDIRECT(BS32),A32,MATCH(TRM,PTAC!$AC$9:$AE$9,0)),INDEX(INDIRECT(BS32),MATCH(TRM,BaselineRow,0),1)))","v":{"$error":"#N/A"}},{"$error":"#N/A"},{"$f":"IF(AI32<>\"\",12/3.412/AI32,IF(IFERROR(SEARCH(\"Heat\",P32,1)>0,FALSE),IF(IFERROR(SEARCH(\"Terminal\",P32,1)>0,FALSE),INDEX(INDIRECT(BS32),A32,3+MATCH(TRM,PTAC!$AC$9:$AE$9,0)),INDEX(INDIRECT(BS32),MATCH(TRM,BaselineRow,0),3)),\"\"))","v":""},{"$f":"IF(AG32<>\"\",AG32,IF(IFERROR(SEARCH(\"Terminal\",P32,1)>0,FALSE),INDEX(INDIRECT(BS32),A32,MATCH(TRM,PTAC!$AC$9:$AE$9,0)),INDEX(INDIRECT(BS32),MATCH(TRM,BaselineRow,0),1)))","v":{"$error":"#N/A"}},{"$error":"#N/A"},{"$f":"IF(AI32<>\"\",12/3.412/AI32,IF(IFERROR(SEARCH(\"Heat\",P32,1)>0,FALSE),IF(IFERROR(SEARCH(\"Terminal\",P32,1)>0,FALSE),INDEX(INDIRECT(BS32),A32,3+MATCH(TRM,PTAC!$AC$9:$AE$9,0)),INDEX(INDIRECT(BS32),MATCH(TRM,BaselineRow,0),3)),\"\"))","v":""},"","","",{"$error":"#N/A"},{"$error":"#N/A"},{"$error":"#N/A"},0,{"$error":"#N/A"},{"$error":"#N/A"},{"$error":"#N/A"},{"$error":"#VALUE!"},{"$error":"#N/A"},{"$error":"#N/A"},{"$error":"#N/A"},{"$error":"#VALUE!"},0,0,0,0,{"$f":"INDEX('Utility Admin'!$P$2:$AD$2,1,MATCH($P32,'Utility Admin'!$P$3:$AD$3,0))","v":{"$error":"#N/A"}},{"$f":"INDEX('Utility Admin'!AE$2:AS$2,1,MATCH($P32,'Utility Admin'!$P$3:$AD$3,0))","v":{"$error":"#N/A"}},{"$f":"IF(kWhOverride=\"\",INDEX('Utility Admin'!$AT$2:$BH$2,1,MATCH($P32,'Utility Admin'!$P$3:$AD$3,0)),kWhOverride)","v":{"$error":"#N/A"}},"",{"$f":"INDEX('Equipment Lookups'!$AF$5:$BS$46,MATCH(Inventory!BL32,'Equipment Lookups'!$J$5:$J$46,0),MATCH(Inventory!DE32,'Equipment Lookups'!$AF$4:$BS$4,0))","v":{"$error":"#N/A"}},{"$f":"INDEX('Equipment Lookups'!$AE$5:$AE$46,MATCH(Inventory!BR32,'Equipment Lookups'!$J$5:$J$46,0))","v":{"$error":"#N/A"}},{"$error":"#N/A"},{"$error":"#N/A"},{"$error":"#N/A"},{"$error":"#N/A"},{"$error":"#N/A"},{"$error":"#N/A"},{"$error":"#N/A"},{"$error":"#N/A"},{"$error":"#N/A"},{"$error":"#N/A"},{"$error":"#N/A"},{"$error":"#N/A"},{"$error":"#N/A"},{"$error":"#N/A"},{"$error":"#N/A"},{"$error":"#N/A"},{"$error":"#N/A"},{"$error":"#N/A"},{"$error":"#N/A"},0,0,0]
[]
[null,null,null,null,null,null,null,{"$f":"IFERROR(INDEX(DefaultUnits,MATCH(F34,EquipmentTypes,0),1),\"\")","v":""},null,null,null,null,null,null,null,null,null,{"$f":"IFERROR(INDEX(DefaultUnits,MATCH(P34,EquipmentTypes,0),1),\"\")","v":""},null,{"$f":"IF(IFERROR(SEARCH(\"Heat\",P34,1)>0,FALSE),R34,\"\")","v":""},null,null,{"$f":"IF(IFERROR(SEARCH(\"chiller\",P34)>0,FALSE),\"A\",\"\")","v":""},{"$f":"IF(IFERROR(SEARCH(\"chiller\",P34)>0,FALSE),\"No\",\"\")","v":""},null,null,null,null,{"$f":"IFERROR(INDEX(DefaultUnits,MATCH(P34,EquipmentTypes,0),3),\"\")","v":""},null,{"$f":"IFERROR(IF(BA34=0,\"\",IF(S34*IF(T34=\"tons\",12000,1)<=65000,\"HSPF\",\"COP\")),\"\")","v":""}]

{"sheet":"Summary","index":3,"n_rows":18,"n_cols":8,"rows_kept":18,"cut":false,"hidden":true,"merged":[[1,2,1,6]]}
[1]
[null,"Project Name:",{"$f":"IF('Project Info'!D4=\"\",\"\",'Project Info'!D4)","v":""}]
[]
[null,null,null,"Total Quantity","Total Non-Coinc kW","Total Peak kW","Total kWh","Total Incentive"]
[null,null,null,{"$f":"SUM(D10:D15)","v":0},{"$f":"SUM(E10:E15)","v":0},{"$f":"SUM(F10:F15)","v":0},{"$f":"SUM(G10:G15)","v":0},{"$f":"SUM(H10:H15)","v":0}]
[null,null,null,""]
[]
[]
[null,null,"EUL","Quantity","Non-Coinc kW","Peak kW","kWh","Incentive"]
[null,"Chiller Air Cooled - Centrifugal",{"$f":"'Equipment Lookups'!AE5","v":25},{"$f":"IFERROR(SUMIF(Inventory!$BR$8:$BR$32,'Equipment Lookups'!$J5,Inventory!$AF$8:$AF$32),0)","v":0},{"$f":"IFERROR(SUMIFS(Inventory!AN$8:AN$32,Inventory!$BR$8:$BR$32,'Equipment Lookups'!$J5,Inventory!AN$8:AN$32,\"<>Check*\"),0)","v":0},{"$f":"IFERROR(SUMIFS(Inventory!AO$8:AO$32,Inventory!$BR$8:$BR$32,'Equipment Lookups'!$J5,Inventory!AO$8:AO$32,\"<>Check*\"),0)","v":0},{"$f":"IFERROR(SUMIFS(Inventory!AP$8:AP$32,Inventory!$BR$8:$BR$32,'Equipment Lookups'!$J5,Inventory!AP$8:AP$32,\"<>Check*\"),0)","v":0},{"$f":"IFERROR(SUMIF(Inventory!$BR$8:$BR$32,'Equipment Lookups'!$J5,Inventory!$AQ$8:$AQ$32),0)","v":0}]
[null,"Chiller Air Cooled - Screw/Scroll/Reciprocating",{"$f":"'Equipment Lookups'!AE6","v":20},{"$f":"IFERROR(SUMIF(Inventory!$BR$8:$BR$32,'Equipment Lookups'!$J6,Inventory!$AF$8:$AF$32),0)","v":0},{"$f":"IFERROR(SUMIFS(Inventory!AN$8:AN$32,Inventory!$BR$8:$BR$32,'Equipment Lookups'!$J6,Inventory!AN$8:AN$32,\"<>Check*\"),0)","v":0},{"$f":"IFERROR(SUMIFS(Inventory!AO$8:AO$32,Inventory!$BR$8:$BR$32,'Equipment Lookups'!$J6,Inventory!AO$8:AO$32,\"<>Check*\"),0)","v":0},{"$f":"IFERROR(SUMIFS(Inventory!AP$8:AP$32,Inventory!$BR$8:$BR$32,'Equipment Lookups'!$J6,Inventory!AP$8:AP$32,\"<>Check*\"),0)","v":0},{"$f":"IFERROR(SUMIF(Inventory!$BR$8:$BR$32,'Equipment Lookups'!$J6,Inventory!$AQ$8:$AQ$32),0)","v":0}]
[null,"Chiller Water Cooled - Centrifugal",{"$f":"'Equipment Lookups'!AE7","v":25},{"$f":"IFERROR(SUMIF(Inventory!$BR$8:$BR$32,'Equipment Lookups'!$J7,Inventory!$AF$8:$AF$32),0)","v":0},{"$f":"IFERROR(SUMIFS(Inventory!AN$8:AN$32,Inventory!$BR$8:$BR$32,'Equipment Lookups'!$J7,Inventory!AN$8:AN$32,\"<>Check*\"),0)","v":0},{"$f":"IFERROR(SUMIFS(Inventory!AO$8:AO$32,Inventory!$BR$8:$BR$32,'Equipment Lookups'!$J7,Inventory!AO$8:AO$32,\"<>Check*\"),0)","v":0},{"$f":"IFERROR(SUMIFS(Inventory!AP$8:AP$32,Inventory!$BR$8:$BR$32,'Equipment Lookups'!$J7,Inventory!AP$8:AP$32,\"<>Check*\"),0)","v":0},{"$f":"IFERROR(SUMIF(Inventory!$BR$8:$BR$32,'Equipment Lookups'!$J7,Inventory!$AQ$8:$AQ$32),0)","v":0}]
[null,"Chiller Water Cooled - Screw/Scroll/Reciprocating",{"$f":"'Equipment Lookups'!AE8","v":20},{"$f":"IFERROR(SUMIF(Inventory!$BR$8:$BR$32,'Equipment Lookups'!$J8,Inventory!$AF$8:$AF$32),0)","v":0},{"$f":"IFERROR(SUMIFS(Inventory!AN$8:AN$32,Inventory!$BR$8:$BR$32,'Equipment Lookups'!$J8,Inventory!AN$8:AN$32,\"<>Check*\"),0)","v":0},{"$f":"IFERROR(SUMIFS(Inventory!AO$8:AO$32,Inventory!$BR$8:$BR$32,'Equipment Lookups'!$J8,Inventory!AO$8:AO$32,\"<>Check*\"),0)","v":0},{"$f":"IFERROR(SUMIFS(Inventory!AP$8:AP$32,Inventory!$BR$8:$BR$32,'Equipment Lookups'!$J8,Inventory!AP$8:AP$32,\"<>Check*\"),0)","v":0},{"$f":"IFERROR(SUMIF(Inventory!$BR$8:$BR$32,'Equipment Lookups'!$J8,Inventory!$AQ$8:$AQ$32),0)","v":0}]
[null,"Air-Cooled AC/HP",{"$f":"'Equipment Lookups'!AE9","v":15},{"$f":"IFERROR(SUMIFS(Inventory!AF8:AF32,Inventory!BR8:BR32,\"*AirConditioner*\",Inventory!BR8:BR32,\"<>*Room*\")+SUMIFS(Inventory!AF8:AF32,Inventory!BR8:BR32,\"*HeatPump*\",Inventory!BR8:BR32,\"<>*Room*\"),0)","v":0},{"$f":"IFERROR(SUMIFS(Inventory!AN$8:AN$32,Inventory!$BR$8:$BR$32,\"*AirConditioner*\",Inventory!$BR$8:$BR$32,\"<>*Room*\",Inventory!AN$8:AN$32,\"<>Check*\")+SUMIFS(Inventory!AN$8:AN$32,Inventory!$BR$8:$BR$32,\"*HeatPump*\",Inventory!$BR$8:$BR$32,\"<>*Room*\",Inventory!AN$8:AN$32,\"<>Check*\"),0)","v":0},{"$f":"IFERROR(SUMIFS(Inventory!AO$8:AO$32,Inventory!$BR$8:$BR$32,\"*AirConditioner*\",Inventory!$BR$8:$BR$32,\"<>*Room*\",Inventory!AO$8:AO$32,\"<>Check*\")+SUMIFS(Inventory!AO$8:AO$32,Inventory!$BR$8:$BR$32,\"*HeatPump*\",Inventory!$BR$8:$BR$32,\"<>*Room*\",Inventory!AO$8:AO$32,\"<>Check*\"),0)","v":0},{"$f":"IFERROR(SUMIFS(Inventory!AP$8:AP$32,Inventory!$BR$8:$BR$32,\"*AirConditioner*\",Inventory!$BR$8:$BR$32,\"<>*Room*\",Inventory!AP$8:AP$32,\"<>Check*\")+SUMIFS(Inventory!AP$8:AP$32,Inventory!$BR$8:$BR$32,\"*HeatPump*\",Inventory!$BR$8:$BR$32,\"<>*Room*\",Inventory!AP$8:AP$32,\"<>Check*\"),0)","v":0},{"$f":"IFERROR(SUMIFS(Inventory!AQ$8:AQ$32,Inventory!$BR$8:$BR$32,\"*AirConditioner*\",Inventory!$BR$8:$BR$32,\"<>*Room*\",Inventory!AQ$8:AQ$32,\"<>Check*\")+SUMIFS(Inventory!AQ$8:AQ$32,Inventory!$BR$8:$BR$32,\"*HeatPump*\",Inventory!$BR$8:$BR$32,\"<>*Room*\",Inventory!AQ$8:AQ$32,\"<>Check*\"),0)","v":0}]
[null,"Room AC/HP",{"$f":"'Equipment Lookups'!AE15","v":9},{"$f":"IFERROR(SUMIFS(Inventory!AF8:AF32,Inventory!BR8:BR32,\"*AirConditioner*\",Inventory!BR8:BR32,\"*Room*\")+SUMIFS(Inventory!AF8:AF32,Inventory!BR8:BR32,\"*HeatPump*\",Inventory!BR8:BR32,\"*Room*\"),0)","v":0},{"$f":"IFERROR(SUMIFS(Inventory!AN$8:AN$32,Inventory!$BR$8:$BR$32,\"*AirConditioner*\",Inventory!$BR$8:$BR$32,\"*Room*\",Inventory!AN$8:AN$32,\"<>Check*\")+SUMIFS(Inventory!AN$8:AN$32,Inventory!$BR$8:$BR$32,\"*HeatPump*\",Inventory!$BR$8:$BR$32,\"*Room*\",Inventory!AN$8:AN$32,\"<>Check*\"),0)","v":0},{"$f":"IFERROR(SUMIFS(Inventory!AO$8:AO$32,Inventory!$BR$8:$BR$32,\"*AirConditioner*\",Inventory!$BR$8:$BR$32,\"*Room*\",Inventory!AO$8:AO$32,\"<>Check*\")+SUMIFS(Inventory!AO$8:AO$32,Inventory!$BR$8:$BR$32,\"*HeatPump*\",Inventory!$BR$8:$BR$32,\"*Room*\",Inventory!AO$8:AO$32,\"<>Check*\"),0)","v":0},{"$f":"IFERROR(SUMIFS(Inventory!AP$8:AP$32,Inventory!$BR$8:$BR$32,\"*AirConditioner*\",Inventory!$BR$8:$BR$32,\"*Room*\",Inventory!AP$8:AP$32,\"<>Check*\")+SUMIFS(Inventory!AP$8:AP$32,Inventory!$BR$8:$BR$32,\"*HeatPump*\",Inventory!$BR$8:$BR$32,\"*Room*\",Inventory!AP$8:AP$32,\"<>Check*\"),0)","v":0},{"$f":"IFERROR(SUMIFS(Inventory!AQ$8:AQ$32,Inventory!$BR$8:$BR$32,\"*AirConditioner*\",Inventory!$BR$8:$BR$32,\"*Room*\",Inventory!AQ$8:AQ$32,\"<>Check*\")+SUMIFS(Inventory!AQ$8:AQ$32,Inventory!$BR$8:$BR$32,\"*HeatPump*\",Inventory!$BR$8:$BR$32,\"*Room*\",Inventory!AQ$8:AQ$32,\"<>Check*\"),0)","v":0}]
[]
[]
[null,"Version:",{"$f":"'Project Info'!K1","v":"v21.0"}]

{"sheet":"Report","index":4,"n_rows":124,"n_cols":13,"rows_kept":124,"cut":false,"hidden":true,"merged":[[104,1,104,5],[105,1,105,5],[106,7,106,9],[123,1,123,5],[125,1,125,5],[39,1,39,2],[39,4,39,5],[43,1,43,5],[46,7,46,8],[46,9,46,10],[20,1,20,5],[22,1,22,5],[29,1,29,2],[32,1,32,5],[34,1,34,2],[34,4,34,5],[18,1,18,2],[1,1,1,5],[2,1,2,5],[4,1,4,5],[5,1,5,5],[6,1,6,5],[7,1,7,5],[13,1,14,5],[15,1,16,2],[17,1,17,2],[15,3,16,5]]}
[1]
[null,"Energy Efficiency Assessment"]
[null,{"$f":"'Project Info'!I7&\" - \"&'Project Info'!I8","v":" - "}]
[]
[null,{"$f":"IF('Project Info'!$D$4=\"\",\"Prepared for: [Company Name]\",CONCATENATE(\"Prepared for: \",'Project Info'!$D$4))","v":"Prepared for: [Company Name]"}]
[null,{"$f":"IF('Project Info'!$D$10=\"\",\"Contact Name:\",CONCATENATE(\"Contact Name: \",'Project Info'!$D$10))","v":"Contact Name:"}]
[null,{"$f":"IF('Project Info'!$D$11=\"\",\"Contact Phone:\",CONCATENATE(\"Contact Phone: \",'Project Info'!$D$11))","v":"Contact Phone:"}]
[null,{"$f":"IF('Project Info'!$I$11=\"\",\"Contact Email:\",CONCATENATE(\"Contact Email: \",'Project Info'!$I$11))","v":"Contact Email:"}]
[]
[null,"Est. Project Cost",{"$f":"'Project Info'!$D$17","v":0},null,"Est. Annual Energy Savings",{"$f":"($B$26*$F$36)+($B$27*$F$37)","v":0}]
[null,"Est. Utility Incentive Rate/kWh",{"$f":"IFERROR(Inventory!AR3/Inventory!AP3,0)","v":0},null,"Simple Payback (years)",{"$f":"MAX(0,IF(ISERROR($C$38/$F$38),0,$C$38/$F$38))","v":0}]
[null,"Est. Utility Incentive*",{"$f":"Inventory!$AQ$3","v":0},null,"Total # of Units",{"$f":"SUM(Inventory!AF8:AF32)","v":0}]
[null,{"$f":"IF('Utility Admin'!$G$2<>999999,\"*Incentive may be capped at $\"&'Utility Admin'!$G$2&\" per project or \"&'Utility Admin'!$H$2*100&\"% of project cost\",\"*Incentive may be capped at \"&'Utility Admin'!$H$2*100&\"% of project cost\")","v":{"$error":"#N/A"}}]
[null,"The undersigned person hereby represents that he/she has received L.O.I. & Project Application and is authorized to commit the Customer to participate in the Program."]
[]
[null,"Incentive to be Paid to:",null,{"$f":"IF('Project Info'!D16=\"\",\"\",'Project Info'!D16)","v":""}]
[]
[]
[null,"Authorized Signature",null,null,"Printed Name","Date"]
[]
[null,"CLEAResult makes no warranties, whether expressed or implied, nor assumes any legal liability or responsibility for the accuracy, completeness, or usefulness of the contents of this Energy Efficiency Assessment. These calculations are based on the rates displayed below. These calculations are not exact and should only be used to formulate a decision on whether or not to pursue an HVAC retrofit."]
[]
[null,{"$f":"TODAY()","v":"2021-01-08"}]
[]
[null,"Rate:"]
[null,{"$f":"'Project Info'!J17","v":0},"$/kW"]
[null,{"$f":"'Project Info'!$I$17","v":0.1},"$/kWh"]
[]
[null,"Building Type:"]
[null,{"$f":"IF(Inventory!C8=\"\",\"\",Inventory!C8)","v":""}]
[]
[null,"Project Description:"]
[null,{"$f":"IF('Project Info'!D19=\"\",\"\",'Project Info'!D19)","v":""}]
[]
[null,"Estimated Project Cost",null,null,"Energy Savings"]
[null,"Est. Project Cost",{"$f":"'Project Info'!$D$17","v":0},null,"Est. kW Savings",{"$f":"Inventory!$AO$3","v":0}]
[null,"Est. Utility Incentive",{"$f":"Inventory!$AQ$3","v":0},null,"Est. kWh Savings",{"$f":"Inventory!$AP$3","v":0}]
[null,"Est. Project Cost after Incentive",{"$f":"$C$36-$C$37","v":0},null,"Est. Annual Energy Savings",{"$f":"($B$26*$F$36)+($B$27*$F$37)","v":0}]
[]
[null,"Payback & Return on Investment",null,null,"Cost of Waiting"]
[null,"Simple Payback (years)",{"$f":"MAX(0,IF(ISERROR($C$38/$F$38),0,$C$38/$F$38))","v":0},null,"Monthly",{"$f":"$F$42/12","v":0}]
[null,"Return on Investment",{"$f":"IF(ISERROR(1/$C$41),0,1/$C$41)","v":0},null,"Annually",{"$f":"$F$38","v":0}]
[]
[null,"CLEAResult makes this tool available to participants in our Energy Efficiency programs. CLEAResult makes no warranties, whether expressed or implied, nor assumes any legal liability or responsibility for the accuracy, completeness, or usefulness of the contents of this Energy Efficiency Assessment. These calculations are based on the rates displayed above. These calculations are not exact and should only be used to formulate a decision on whether or not to pursue an HVAC retrofit."]
[]
[]
[null,null,null,null,null,null,null,"Existing",null,"Post-Retrofit",null,"Existing",{"$f":"($H$49*$B$26)+($I$49*$B$27)","v":0}]
[null,null,null,null,null,null,null,"kW","kWh","kW","kWh","Retrofit",{"$f":"($J$49*$B$26)+($K$49*$B$27)","v":0}]
[null,null,null,null,null,null,null,{"$f":"IFERROR(SUM(Inventory!EB8:EB32),0)","v":0},{"$f":"IFERROR(SUM(Inventory!EA8:EA32),0)","v":0},{"$f":"$H$49-$F$36","v":0},{"$f":"$I$49-$F$37","v":0},"Cost of Waiting",{"$f":"$M$47-$M$48","v":0}]
[]
[null,null,null,null,null,null,null,null,null,null,null,"Y-Axis","X-Axis"]
[null,null,null,null,null,null,null,null,null,null,null,"ANNUAL COST\nOF WAITING!",{"$f":"$M$49","v":0}]
[null,null,null,null,null,null,null,null,null,null,null,"Annual Cost\nafter Retrofit",{"$f":"$M$48","v":0}]
[null,null,null,null,null,null,null,null,null,null,null,"Annual Cost\nbefore Retrofit",{"$f":"$M$47","v":0}]
[]
[]
[]
[]
[]
[]
[]
[]
[]
[]
[]
[]
[]
[]
[]
[]
[]
[null,null,"Totals:",null,null,"Totals:"]
[null,"Est. Demand Reduction (kW) :",{"$f":"$F$36","v":0},null,"Est. Total Year 1 Cash Flow :",{"$f":"$J$79","v":0}]
[null,"Est. Energy Reduction (kWh) :",{"$f":"$F$37","v":0},null,"Est. Total Year 5 Cash Flow :",{"$f":"$J$80","v":0}]
[null,"Est. Annual $ Savings :",{"$f":"$F$38","v":0},null,"Est. Total Year 10 Cash Flow :",{"$f":"$J$81","v":0}]
[null,"Est. Project Cost :",{"$f":"$C$36","v":0},null,"Est. Total Year 15 Cash Flow :",{"$f":"$J$82","v":0}]
[null,"Est. Program Incentive :",{"$f":"$C$37","v":0}]
[]
[null,null,null,null,null,null,null,"Year 1",{"$f":"$F$38","v":0},{"$f":"$I79-$C$38","v":0}]
[null,null,null,null,null,null,null,"Year 5",{"$f":"$I$79*5","v":0},{"$f":"$I80-$C$38","v":0}]
[null,null,null,null,null,null,null,"Year 10",{"$f":"$I$79*10","v":0},{"$f":"$I81-$C$38","v":0}]
[null,null,null,null,null,null,null,"Year 15",{"$f":"$I$79*15","v":0},{"$f":"$I82-$C$38","v":0}]
[]
[]
[]
[]
[]
[]
[]
[]
[]
[]
[]
[]
[]
[]
[]
[]
[]
[]
[]
[]
[]
[]
[null,"Annual Carbon Impact"]
[null,"Your energy efficiency opportunity's estimated energy savings is roughly equivalent to the annual carbon dioxide emissions reduction of:"]
[null,null,null,null,null,null,null,"CO2 Equivalency Type",null,null,"kWh","CO2 (Tons)","Equivalency"]
[null,null,null,null,null,null,null,"Acres of Forest               ",null,null,{"$f":"$F$37","v":0},{"$f":"$K108*0.00068956","v":0},{"$f":"$L108/1.22","v":0}]
[null,null,null,null,null,null,null,"Recyc Tons of Waste               ",null,null,{"$f":"$F$37","v":0},{"$f":"$K109*0.00068956","v":0},{"$f":"$L109/2.67","v":0}]
[null,null,null,null,null,null,null,"Passenger Vehicles               ",null,null,{"$f":"$F$37","v":0},{"$f":"$K110*0.00068956","v":0},{"$f":"$L110/4.8","v":0}]
[null,null,null,null,null,null,null,"Homes Worth of Elec               ",null,null,{"$f":"$F$37","v":0},{"$f":"$K111*0.00068956","v":0},{"$f":"$L111/6.68","v":0}]
[null,null,null,null,null,null,null,"Tanker Trucks of Gas               ",null,null,{"$f":"$F$37","v":0},{"$f":"$K112*0.00068956","v":0},{"$f":"$L112/75.82","v":0}]
[]
[]
[]
[]
[]
[]
[]
[]
[]
[]
[]
[null,"NOTES"]

{"sheet":"Inspection Form","index":5,"n_rows":31,"n_cols":24,"rows_kept":31,"cut":false,"hidden":true,"merged":[[0,13,0,14],[2,2,4,2],[2,3,4,3],[3,4,4,4],[3,6,3,7],[3,8,4,8],[3,5,4,5],[3,9,4,9],[3,10,4,10],[3,14,4,14],[3,21,4,21],[3,22,4,22],[3,17,4,17],[3,18,4,18],[3,19,4,19],[3,15,3,16],[3,11,4,11],[3,12,4,12],[3,13,4,13],[3,20,4,20]]}
[1,null,"HVAC INSPECTION FORM",null,null,null,null,null,null,null,null,null,"Project:",{"$f":"IF('Project Info'!D4=\"\",\"\",'Project Info'!D4)","v":""},null,null,null,null,null,"Pre Inspection"]
[null,null,"Post Inspection",null,null,null,null,null,null,null,null,null,null,null,null,null,null,null,null,"Post Inspection"]
[null,null,"Project Type","Building Type","Removed Equipment",null,null,null,null,null,null,null,"Installed Equipment"]
[null,null,null,null,"Make / Model #","Equipment Type","Cooling Capacity",null,"Equipment Detail","Heating Section Type","# of Units","Manuf Year","Make / Model #","Serial #","Equipment Type","Cooling Capacity",null,"Equipment Detail","Heating Section Type","# of Units","Part of Redundant Chiller System?","HP of Condenser Water Pump","HP of Cooling Tower Fan"]
[null,null,null,null,null,null,"Units","Rating",null,null,null,null,null,null,null,"Units","Rating"]
[null,1,{"$f":"IF(Inventory!B8=\"\",\"\",Inventory!B8)","v":""},{"$f":"IF(Inventory!C8=\"\",\"\",Inventory!C8)","v":""},{"$f":"IF(Inventory!D8=\"\",\"\",Inventory!D8)","v":""},{"$f":"IF(Inventory!F8=\"\",\"\",Inventory!F8)","v":""},{"$f":"IF(Inventory!H8=\"\",\"\",Inventory!H8)","v":""},{"$f":"IF(Inventory!G8=\"\",\"\",Inventory!G8)","v":""},{"$f":"IF(Inventory!I8=\"\",\"\",Inventory!I8)","v":""},{"$f":"IF(Inventory!J8=\"\",\"\",Inventory!J8)","v":""},{"$f":"IF(Inventory!K8=\"\",\"\",Inventory!K8)","v":""},{"$f":"IF(Inventory!L8=\"\",\"\",Inventory!L8)","v":""},{"$f":"IF(Inventory!M8=\"\",\"\",Inventory!M8)","v":""},{"$f":"IF(Inventory!N8=\"\",\"\",Inventory!N8)","v":""},{"$f":"IF(Inventory!P8=\"\",\"\",Inventory!P8)","v":""},{"$f":"IF(Inventory!R8=\"\",\"\",Inventory!R8)","v":""},{"$f":"IF(Inventory!Q8=\"\",\"\",Inventory!Q8)","v":""},{"$f":"IF(Inventory!U8=\"\",\"\",Inventory!U8)","v":""},{"$f":"IF(Inventory!V8=\"\",\"\",Inventory!V8)","v":""},{"$f":"IF(Inventory!AF8=\"\",\"\",Inventory!AF8)","v":""},{"$f":"IF(Inventory!X8=\"\",\"\",Inventory!X8)","v":""},{"$f":"IF(Inventory!Y8=\"\",\"\",Inventory!Y8)","v":""},{"$f":"IF(Inventory!Z8=\"\",\"\",Inventory!Z8)","v":""},{"$f":"IFERROR(SEARCH(\"Chiller\",O6),0)","v":0}]
[null,2,{"$f":"IF(Inventory!B9=\"\",\"\",Inventory!B9)","v":""},{"$f":"IF(Inventory!C9=\"\",\"\",Inventory!C9)","v":""},{"$f":"IF(Inventory!D9=\"\",\"\",Inventory!D9)","v":""},{"$f":"IF(Inventory!F9=\"\",\"\",Inventory!F9)","v":""},{"$f":"IF(Inventory!H9=\"\",\"\",Inventory!H9)","v":""},{"$f":"IF(Inventory!G9=\"\",\"\",Inventory!G9)","v":""},{"$f":"IF(Inventory!I9=\"\",\"\",Inventory!I9)","v":""},{"$f":"IF(Inventory!J9=\"\",\"\",Inventory!J9)","v":""},{"$f":"IF(Inventory!K9=\"\",\"\",Inventory!K9)","v":""},{"$f":"IF(Inventory!L9=\"\",\"\",Inventory!L9)","v":""},{"$f":"IF(Inventory!M9=\"\",\"\",Inventory!M9)","v":""},{"$f":"IF(Inventory!N9=\"\",\"\",Inventory!N9)","v":""},{"$f":"IF(Inventory!P9=\"\",\"\",Inventory!P9)","v":""},{"$f":"IF(Inventory!R9=\"\",\"\",Inventory!R9)","v":""},{"$f":"IF(Inventory!Q9=\"\",\"\",Inventory!Q9)","v":""},{"$f":"IF(Inventory!U9=\"\",\"\",Inventory!U9)","v":""},{"$f":"IF(Inventory!V9=\"\",\"\",Inventory!V9)","v":""},{"$f":"IF(Inventory!AF9=\"\",\"\",Inventory!AF9)","v":""},{"$f":"IF(Inventory!X9=\"\",\"\",Inventory!X9)","v":""},{"$f":"IF(Inventory!Y9=\"\",\"\",Inventory!Y9)","v":""},{"$f":"IF(Inventory!Z9=\"\",\"\",Inventory!Z9)","v":""},{"$f":"IFERROR(SEARCH(\"Chiller\",O7),0)","v":0}]
[null,3,{"$f":"IF(Inventory!B10=\"\",\"\",Inventory!B10)","v":""},{"$f":"IF(Inventory!C10=\"\",\"\",Inventory!C10)","v":""},{"$f":"IF(Inventory!D10=\"\",\"\",Inventory!D10)","v":""},{"$f":"IF(Inventory!F10=\"\",\"\",Inventory!F10)","v":""},{"$f":"IF(Inventory!H10=\"\",\"\",Inventory!H10)","v":""},{"$f":"IF(Inventory!G10=\"\",\"\",Inventory!G10)","v":""},{"$f":"IF(Inventory!I10=\"\",\"\",Inventory!I10)","v":""},{"$f":"IF(Inventory!J10=\"\",\"\",Inventory!J10)","v":""},{"$f":"IF(Inventory!K10=\"\",\"\",Inventory!K10)","v":""},{"$f":"IF(Inventory!L10=\"\",\"\",Inventory!L10)","v":""},{"$f":"IF(Inventory!M10=\"\",\"\",Inventory!M10)","v":""},{"$f":"IF(Inventory!N10=\"\",\"\",Inventory!N10)","v":""},{"$f":"IF(Inventory!P10=\"\",\"\",Inventory!P10)","v":""},{"$f":"IF(Inventory!R10=\"\",\"\",Inventory!R10)","v":""},{"$f":"IF(Inventory!Q10=\"\",\"\",Inventory!Q10)","v":""},{"$f":"IF(Inventory!U10=\"\",\"\",Inventory!U10)","v":""},{"$f":"IF(Inventory!V10=\"\",\"\",Inventory!V10)","v":""},{"$f":"IF(Inventory!AF10=\"\",\"\",Inventory!AF10)","v":""},{"$f":"IF(Inventory!X10=\"\",\"\",Inventory!X10)","v":""},{"$f":"IF(Inventory!Y10=\"\",\"\",Inventory!Y10)","v":""},{"$f":"IF(Inventory!Z10=\"\",\"\",Inventory!Z10)","v":""},0]
[null,4,{"$f":"IF(Inventory!B11=\"\",\"\",Inventory!B11)","v":""},{"$f":"IF(Inventory!C11=\"\",\"\",Inventory!C11)","v":""},{"$f":"IF(Inventory!D11=\"\",\"\",Inventory!D11)","v":""},{"$f":"IF(Inventory!F11=\"\",\"\",Inventory!F11)","v":""},{"$f":"IF(Inventory!H11=\"\",\"\",Inventory!H11)","v":""},{"$f":"IF(Inventory!G11=\"\",\"\",Inventory!G11)","v":""},{"$f":"IF(Inventory!I11=\"\",\"\",Inventory!I11)","v":""},{"$f":"IF(Inventory!J11=\"\",\"\",Inventory!J11)","v":""},{"$f":"IF(Inventory!K11=\"\",\"\",Inventory!K11)","v":""},{"$f":"IF(Inventory!L11=\"\",\"\",Inventory!L11)","v":""},{"$f":"IF(Inventory!M11=\"\",\"\",Inventory!M11)","v":""},{"$f":"IF(Inventory!N11=\"\",\"\",Inventory!N11)","v":""},{"$f":"IF(Inventory!P11=\"\",\"\",Inventory!P11)","v":""},{"$f":"IF(Inventory!R11=\"\",\"\",Inventory!R11)","v":""},{"$f":"IF(Inventory!Q11=\"\",\"\",Inventory!Q11)","v":""},{"$f":"IF(Inventory!U11=\"\",\"\",Inventory!U11)","v":""},{"$f":"IF(Inventory!V11=\"\",\"\",Inventory!V11)","v":""},{"$f":"IF(Inventory!AF11=\"\",\"\",Inventory!AF11)","v":""},{"$f":"IF(Inventory!X11=\"\",\"\",Inventory!X11)","v":""},{"$f":"IF(Inventory!Y11=\"\",\"\",Inventory!Y11)","v":""},{"$f":"IF(Inventory!Z11=\"\",\"\",Inventory!Z11)","v":""},0]
[null,5,{"$f":"IF(Inventory!B12=\"\",\"\",Inventory!B12)","v":""},{"$f":"IF(Inventory!C12=\"\",\"\",Inventory!C12)","v":""},{"$f":"IF(Inventory!D12=\"\",\"\",Inventory!D12)","v":""},{"$f":"IF(Inventory!F12=\"\",\"\",Inventory!F12)","v":""},{"$f":"IF(Inventory!H12=\"\",\"\",Inventory!H12)","v":""},{"$f":"IF(Inventory!G12=\"\",\"\",Inventory!G12)","v":""},{"$f":"IF(Inventory!I12=\"\",\"\",Inventory!I12)","v":""},{"$f":"IF(Inventory!J12=\"\",\"\",Inventory!J12)","v":""},{"$f":"IF(Inventory!K12=\"\",\"\",Inventory!K12)","v":""},{"$f":"IF(Inventory!L12=\"\",\"\",Inventory!L12)","v":""},{"$f":"IF(Inventory!M12=\"\",\"\",Inventory!M12)","v":""},{"$f":"IF(Inventory!N12=\"\",\"\",Inventory!N12)","v":""},{"$f":"IF(Inventory!P12=\"\",\"\",Inventory!P12)","v":""},{"$f":"IF(Inventory!R12=\"\",\"\",Inventory!R12)","v":""},{"$f":"IF(Inventory!Q12=\"\",\"\",Inventory!Q12)","v":""},{"$f":"IF(Inventory!U12=\"\",\"\",Inventory!U12)","v":""},{"$f":"IF(Inventory!V12=\"\",\"\",Inventory!V12)","v":""},{"$f":"IF(Inventory!AF12=\"\",\"\",Inventory!AF12)","v":""},{"$f":"IF(Inventory!X12=\"\",\"\",Inventory!X12)","v":""},{"$f":"IF(Inventory!Y12=\"\",\"\",Inventory!Y12)","v":""},{"$f":"IF(Inventory!Z12=\"\",\"\",Inventory!Z12)","v":""},0]
[null,6,{"$f":"IF(Inventory!B13=\"\",\"\",Inventory!B13)","v":""},{"$f":"IF(Inventory!C13=\"\",\"\",Inventory!C13)","v":""},{"$f":"IF(Inventory!D13=\"\",\"\",Inventory!D13)","v":""},{"$f":"IF(Inventory!F13=\"\",\"\",Inventory!F13)","v":""},{"$f":"IF(Inventory!H13=\"\",\"\",Inventory!H13)","v":""},{"$f":"IF(Inventory!G13=\"\",\"\",Inventory!G13)","v":""},{"$f":"IF(Inventory!I13=\"\",\"\",Inventory!I13)","v":""},{"$f":"IF(Inventory!J13=\"\",\"\",Inventory!J13)","v":""},{"$f":"IF(Inventory!K13=\"\",\"\",Inventory!K13)","v":""},{"$f":"IF(Inventory!L13=\"\",\"\",Inventory!L13)","v":""},{"$f":"IF(Inventory!M13=\"\",\"\",Inventory!M13)","v":""},{"$f":"IF(Inventory!N13=\"\",\"\",Inventory!N13)","v":""},{"$f":"IF(Inventory!P13=\"\",\"\",Inventory!P13)","v":""},{"$f":"IF(Inventory!R13=\"\",\"\",Inventory!R13)","v":""},{"$f":"IF(Inventory!Q13=\"\",\"\",Inventory!Q13)","v":""},{"$f":"IF(Inventory!U13=\"\",\"\",Inventory!U13)","v":""},{"$f":"IF(Inventory!V13=\"\",\"\",Inventory!V13)","v":""},{"$f":"IF(Inventory!AF13=\"\",\"\",Inventory!AF13)","v":""},{"$f":"IF(Inventory!X13=\"\",\"\",Inventory!X13)","v":""},{"$f":"IF(Inventory!Y13=\"\",\"\",Inventory!Y13)","v":""},{"$f":"IF(Inventory!Z13=\"\",\"\",Inventory!Z13)","v":""},0]
[null,7,{"$f":"IF(Inventory!B14=\"\",\"\",Inventory!B14)","v":""},{"$f":"IF(Inventory!C14=\"\",\"\",Inventory!C14)","v":""},{"$f":"IF(Inventory!D14=\"\",\"\",Inventory!D14)","v":""},{"$f":"IF(Inventory!F14=\"\",\"\",Inventory!F14)","v":""},{"$f":"IF(Inventory!H14=\"\",\"\",Inventory!H14)","v":""},{"$f":"IF(Inventory!G14=\"\",\"\",Inventory!G14)","v":""},{"$f":"IF(Inventory!I14=\"\",\"\",Inventory!I14)","v":""},{"$f":"IF(Inventory!J14=\"\",\"\",Inventory!J14)","v":""},{"$f":"IF(Inventory!K14=\"\",\"\",Inventory!K14)","v":""},{"$f":"IF(Inventory!L14=\"\",\"\",Inventory!L14)","v":""},{"$f":"IF(Inventory!M14=\"\",\"\",Inventory!M14)","v":""},{"$f":"IF(Inventory!N14=\"\",\"\",Inventory!N14)","v":""},{"$f":"IF(Inventory!P14=\"\",\"\",Inventory!P14)","v":""},{"$f":"IF(Inventory!R14=\"\",\"\",Inventory!R14)","v":""},{"$f":"IF(Inventory!Q14=\"\",\"\",Inventory!Q14)","v":""},{"$f":"IF(Inventory!U14=\"\",\"\",Inventory!U14)","v":""},{"$f":"IF(Inventory!V14=\"\",\"\",Inventory!V14)","v":""},{"$f":"IF(Inventory!AF14=\"\",\"\",Inventory!AF14)","v":""},{"$f":"IF(Inventory!X14=\"\",\"\",Inventory!X14)","v":""},{"$f":"IF(Inventory!Y14=\"\",\"\",Inventory!Y14)","v":""},{"$f":"IF(Inventory!Z14=\"\",\"\",Inventory!Z14)","v":""},0]
[null,8,{"$f":"IF(Inventory!B15=\"\",\"\",Inventory!B15)","v":""},{"$f":"IF(Inventory!C15=\"\",\"\",Inventory!C15)","v":""},{"$f":"IF(Inventory!D15=\"\",\"\",Inventory!D15)","v":""},{"$f":"IF(Inventory!F15=\"\",\"\",Inventory!F15)","v":""},{"$f":"IF(Inventory!H15=\"\",\"\",Inventory!H15)","v":""},{"$f":"IF(Inventory!G15=\"\",\"\",Inventory!G15)","v":""},{"$f":"IF(Inventory!I15=\"\",\"\",Inventory!I15)","v":""},{"$f":"IF(Inventory!J15=\"\",\"\",Inventory!J15)","v":""},{"$f":"IF(Inventory!K15=\"\",\"\",Inventory!K15)","v":""},{"$f":"IF(Inventory!L15=\"\",\"\",Inventory!L15)","v":""},{"$f":"IF(Inventory!M15=\"\",\"\",Inventory!M15)","v":""},{"$f":"IF(Inventory!N15=\"\",\"\",Inventory!N15)","v":""},{"$f":"IF(Inventory!P15=\"\",\"\",Inventory!P15)","v":""},{"$f":"IF(Inventory!R15=\"\",\"\",Inventory!R15)","v":""},{"$f":"IF(Inventory!Q15=\"\",\"\",Inventory!Q15)","v":""},{"$f":"IF(Inventory!U15=\"\",\"\",Inventory!U15)","v":""},{"$f":"IF(Inventory!V15=\"\",\"\",Inventory!V15)","v":""},{"$f":"IF(Inventory!AF15=\"\",\"\",Inventory!AF15)","v":""},{"$f":"IF(Inventory!X15=\"\",\"\",Inventory!X15)","v":""},{"$f":"IF(Inventory!Y15=\"\",\"\",Inventory!Y15)","v":""},{"$f":"IF(Inventory!Z15=\"\",\"\",Inventory!Z15)","v":""},0]
[null,9,{"$f":"IF(Inventory!B16=\"\",\"\",Inventory!B16)","v":""},{"$f":"IF(Inventory!C16=\"\",\"\",Inventory!C16)","v":""},{"$f":"IF(Inventory!D16=\"\",\"\",Inventory!D16)","v":""},{"$f":"IF(Inventory!F16=\"\",\"\",Inventory!F16)","v":""},{"$f":"IF(Inventory!H16=\"\",\"\",Inventory!H16)","v":""},{"$f":"IF(Inventory!G16=\"\",\"\",Inventory!G16)","v":""},{"$f":"IF(Inventory!I16=\"\",\"\",Inventory!I16)","v":""},{"$f":"IF(Inventory!J16=\"\",\"\",Inventory!J16)","v":""},{"$f":"IF(Inventory!K16=\"\",\"\",Inventory!K16)","v":""},{"$f":"IF(Inventory!L16=\"\",\"\",Inventory!L16)","v":""},{"$f":"IF(Inventory!M16=\"\",\"\",Inventory!M16)","v":""},{"$f":"IF(Inventory!N16=\"\",\"\",Inventory!N16)","v":""},{"$f":"IF(Inventory!P16=\"\",\"\",Inventory!P16)","v":""},{"$f":"IF(Inventory!R16=\"\",\"\",Inventory!R16)","v":""},{"$f":"IF(Inventory!Q16=\"\",\"\",Inventory!Q16)","v":""},{"$f":"IF(Inventory!U16=\"\",\"\",Inventory!U16)","v":""},{"$f":"IF(Inventory!V16=\"\",\"\",Inventory!V16)","v":""},{"$f":"IF(Inventory!AF16=\"\",\"\",Inventory!AF16)","v":""},{"$f":"IF(Inventory!X16=\"\",\"\",Inventory!X16)","v":""},{"$f":"IF(Inventory!Y16=\"\",\"\",Inventory!Y16)","v":""},{"$f":"IF(Inventory!Z16=\"\",\"\",Inventory!Z16)","v":""},0]
[null,10,{"$f":"IF(Inventory!B17=\"\",\"\",Inventory!B17)","v":""},{"$f":"IF(Inventory!C17=\"\",\"\",Inventory!C17)","v":""},{"$f":"IF(Inventory!D17=\"\",\"\",Inventory!D17)","v":""},{"$f":"IF(Inventory!F17=\"\",\"\",Inventory!F17)","v":""},{"$f":"IF(Inventory!H17=\"\",\"\",Inventory!H17)","v":""},{"$f":"IF(Inventory!G17=\"\",\"\",Inventory!G17)","v":""},{"$f":"IF(Inventory!I17=\"\",\"\",Inventory!I17)","v":""},{"$f":"IF(Inventory!J17=\"\",\"\",Inventory!J17)","v":""},{"$f":"IF(Inventory!K17=\"\",\"\",Inventory!K17)","v":""},{"$f":"IF(Inventory!L17=\"\",\"\",Inventory!L17)","v":""},{"$f":"IF(Inventory!M17=\"\",\"\",Inventory!M17)","v":""},{"$f":"IF(Inventory!N17=\"\",\"\",Inventory!N17)","v":""},{"$f":"IF(Inventory!P17=\"\",\"\",Inventory!P17)","v":""},{"$f":"IF(Inventory!R17=\"\",\"\",Inventory!R17)","v":""},{"$f":"IF(Inventory!Q17=\"\",\"\",Inventory!Q17)","v":""},{"$f":"IF(Inventory!U17=\"\",\"\",Inventory!U17)","v":""},{"$f":"IF(Inventory!V17=\"\",\"\",Inventory!V17)","v":""},{"$f":"IF(Inventory!AF17=\"\",\"\",Inventory!AF17)","v":""},{"$f":"IF(Inventory!X17=\"\",\"\",Inventory!X17)","v":""},{"$f":"IF(Inventory!Y17=\"\",\"\",Inventory!Y17)","v":""},{"$f":"IF(Inventory!Z17=\"\",\"\",Inventory!Z17)","v":""},0]
[null,11,{"$f":"IF(Inventory!B18=\"\",\"\",Inventory!B18)","v":""},{"$f":"IF(Inventory!C18=\"\",\"\",Inventory!C18)","v":""},{"$f":"IF(Inventory!D18=\"\",\"\",Inventory!D18)","v":""},{"$f":"IF(Inventory!F18=\"\",\"\",Inventory!F18)","v":""},{"$f":"IF(Inventory!H18=\"\",\"\",Inventory!H18)","v":""},{"$f":"IF(Inventory!G18=\"\",\"\",Inventory!G18)","v":""},{"$f":"IF(Inventory!I18=\"\",\"\",Inventory!I18)","v":""},{"$f":"IF(Inventory!J18=\"\",\"\",Inventory!J18)","v":""},{"$f":"IF(Inventory!K18=\"\",\"\",Inventory!K18)","v":""},{"$f":"IF(Inventory!L18=\"\",\"\",Inventory!L18)","v":""},{"$f":"IF(Inventory!M18=\"\",\"\",Inventory!M18)","v":""},{"$f":"IF(Inventory!N18=\"\",\"\",Inventory!N18)","v":""},{"$f":"IF(Inventory!P18=\"\",\"\",Inventory!P18)","v":""},{"$f":"IF(Inventory!R18=\"\",\"\",Inventory!R18)","v":""},{"$f":"IF(Inventory!Q18=\"\",\"\",Inventory!Q18)","v":""},{"$f":"IF(Inventory!U18=\"\",\"\",Inventory!U18)","v":""},{"$f":"IF(Inventory!V18=\"\",\"\",Inventory!V18)","v":""},{"$f":"IF(Inventory!AF18=\"\",\"\",Inventory!AF18)","v":""},{"$f":"IF(Inventory!X18=\"\",\"\",Inventory!X18)","v":""},{"$f":"IF(Inventory!Y18=\"\",\"\",Inventory!Y18)","v":""},{"$f":"IF(Inventory!Z18=\"\",\"\",Inventory!Z18)","v":""},0]
[null,12,{"$f":"IF(Inventory!B19=\"\",\"\",Inventory!B19)","v":""},{"$f":"IF(Inventory!C19=\"\",\"\",Inventory!C19)","v":""},{"$f":"IF(Inventory!D19=\"\",\"\",Inventory!D19)","v":""},{"$f":"IF(Inventory!F19=\"\",\"\",Inventory!F19)","v":""},{"$f":"IF(Inventory!H19=\"\",\"\",Inventory!H19)","v":""},{"$f":"IF(Inventory!G19=\"\",\"\",Inventory!G19)","v":""},{"$f":"IF(Inventory!I19=\"\",\"\",Inventory!I19)","v":""},{"$f":"IF(Inventory!J19=\"\",\"\",Inventory!J19)","v":""},{"$f":"IF(Inventory!K19=\"\",\"\",Inventory!K19)","v":""},{"$f":"IF(Inventory!L19=\"\",\"\",Inventory!L19)","v":""},{"$f":"IF(Inventory!M19=\"\",\"\",Inventory!M19)","v":""},{"$f":"IF(Inventory!N19=\"\",\"\",Inventory!N19)","v":""},{"$f":"IF(Inventory!P19=\"\",\"\",Inventory!P19)","v":""},{"$f":"IF(Inventory!R19=\"\",\"\",Inventory!R19)","v":""},{"$f":"IF(Inventory!Q19=\"\",\"\",Inventory!Q19)","v":""},{"$f":"IF(Inventory!U19=\"\",\"\",Inventory!U19)","v":""},{"$f":"IF(Inventory!V19=\"\",\"\",Inventory!V19)","v":""},{"$f":"IF(Inventory!AF19=\"\",\"\",Inventory!AF19)","v":""},{"$f":"IF(Inventory!X19=\"\",\"\",Inventory!X19)","v":""},{"$f":"IF(Inventory!Y19=\"\",\"\",Inventory!Y19)","v":""},{"$f":"IF(Inventory!Z19=\"\",\"\",Inventory!Z19)","v":""},0]
[null,13,{"$f":"IF(Inventory!B20=\"\",\"\",Inventory!B20)","v":""},{"$f":"IF(Inventory!C20=\"\",\"\",Inventory!C20)","v":""},{"$f":"IF(Inventory!D20=\"\",\"\",Inventory!D20)","v":""},{"$f":"IF(Inventory!F20=\"\",\"\",Inventory!F20)","v":""},{"$f":"IF(Inventory!H20=\"\",\"\",Inventory!H20)","v":""},{"$f":"IF(Inventory!G20=\"\",\"\",Inventory!G20)","v":""},{"$f":"IF(Inventory!I20=\"\",\"\",Inventory!I20)","v":""},{"$f":"IF(Inventory!J20=\"\",\"\",Inventory!J20)","v":""},{"$f":"IF(Inventory!K20=\"\",\"\",Inventory!K20)","v":""},{"$f":"IF(Inventory!L20=\"\",\"\",Inventory!L20)","v":""},{"$f":"IF(Inventory!M20=\"\",\"\",Inventory!M20)","v":""},{"$f":"IF(Inventory!N20=\"\",\"\",Inventory!N20)","v":""},{"$f":"IF(Inventory!P20=\"\",\"\",Inventory!P20)","v":""},{"$f":"IF(Inventory!R20=\"\",\"\",Inventory!R20)","v":""},{"$f":"IF(Inventory!Q20=\"\",\"\",Inventory!Q20)","v":""},{"$f":"IF(Inventory!U20=\"\",\"\",Inventory!U20)","v":""},{"$f":"IF(Inventory!V20=\"\",\"\",Inventory!V20)","v":""},{"$f":"IF(Inventory!AF20=\"\",\"\",Inventory!AF20)","v":""},{"$f":"IF(Inventory!X20=\"\",\"\",Inventory!X20)","v":""},{"$f":"IF(Inventory!Y20=\"\",\"\",Inventory!Y20)","v":""},{"$f":"IF(Inventory!Z20=\"\",\"\",Inventory!Z20)","v":""},0]
[null,14,{"$f":"IF(Inventory!B21=\"\",\"\",Inventory!B21)","v":""},{"$f":"IF(Inventory!C21=\"\",\"\",Inventory!C21)","v":""},{"$f":"IF(Inventory!D21=\"\",\"\",Inventory!D21)","v":""},{"$f":"IF(Inventory!F21=\"\",\"\",Inventory!F21)","v":""},{"$f":"IF(Inventory!H21=\"\",\"\",Inventory!H21)","v":""},{"$f":"IF(Inventory!G21=\"\",\"\",Inventory!G21)","v":""},{"$f":"IF(Inventory!I21=\"\",\"\",Inventory!I21)","v":""},{"$f":"IF(Inventory!J21=\"\",\"\",Inventory!J21)","v":""},{"$f":"IF(Inventory!K21=\"\",\"\",Inventory!K21)","v":""},{"$f":"IF(Inventory!L21=\"\",\"\",Inventory!L21)","v":""},{"$f":"IF(Inventory!M21=\"\",\"\",Inventory!M21)","v":""},{"$f":"IF(Inventory!N21=\"\",\"\",Inventory!N21)","v":""},{"$f":"IF(Inventory!P21=\"\",\"\",Inventory!P21)","v":""},{"$f":"IF(Inventory!R21=\"\",\"\",Inventory!R21)","v":""},{"$f":"IF(Inventory!Q21=\"\",\"\",Inventory!Q21)","v":""},{"$f":"IF(Inventory!U21=\"\",\"\",Inventory!U21)","v":""},{"$f":"IF(Inventory!V21=\"\",\"\",Inventory!V21)","v":""},{"$f":"IF(Inventory!AF21=\"\",\"\",Inventory!AF21)","v":""},{"$f":"IF(Inventory!X21=\"\",\"\",Inventory!X21)","v":""},{"$f":"IF(Inventory!Y21=\"\",\"\",Inventory!Y21)","v":""},{"$f":"IF(Inventory!Z21=\"\",\"\",Inventory!Z21)","v":""},0]
[null,15,{"$f":"IF(Inventory!B22=\"\",\"\",Inventory!B22)","v":""},{"$f":"IF(Inventory!C22=\"\",\"\",Inventory!C22)","v":""},{"$f":"IF(Inventory!D22=\"\",\"\",Inventory!D22)","v":""},{"$f":"IF(Inventory!F22=\"\",\"\",Inventory!F22)","v":""},{"$f":"IF(Inventory!H22=\"\",\"\",Inventory!H22)","v":""},{"$f":"IF(Inventory!G22=\"\",\"\",Inventory!G22)","v":""},{"$f":"IF(Inventory!I22=\"\",\"\",Inventory!I22)","v":""},{"$f":"IF(Inventory!J22=\"\",\"\",Inventory!J22)","v":""},{"$f":"IF(Inventory!K22=\"\",\"\",Inventory!K22)","v":""},{"$f":"IF(Inventory!L22=\"\",\"\",Inventory!L22)","v":""},{"$f":"IF(Inventory!M22=\"\",\"\",Inventory!M22)","v":""},{"$f":"IF(Inventory!N22=\"\",\"\",Inventory!N22)","v":""},{"$f":"IF(Inventory!P22=\"\",\"\",Inventory!P22)","v":""},{"$f":"IF(Inventory!R22=\"\",\"\",Inventory!R22)","v":""},{"$f":"IF(Inventory!Q22=\"\",\"\",Inventory!Q22)","v":""},{"$f":"IF(Inventory!U22=\"\",\"\",Inventory!U22)","v":""},{"$f":"IF(Inventory!V22=\"\",\"\",Inventory!V22)","v":""},{"$f":"IF(Inventory!AF22=\"\",\"\",Inventory!AF22)","v":""},{"$f":"IF(Inventory!X22=\"\",\"\",Inventory!X22)","v":""},{"$f":"IF(Inventory!Y22=\"\",\"\",Inventory!Y22)","v":""},{"$f":"IF(Inventory!Z22=\"\",\"\",Inventory!Z22)","v":""},0]
[null,16,{"$f":"IF(Inventory!B23=\"\",\"\",Inventory!B23)","v":""},{"$f":"IF(Inventory!C23=\"\",\"\",Inventory!C23)","v":""},{"$f":"IF(Inventory!D23=\"\",\"\",Inventory!D23)","v":""},{"$f":"IF(Inventory!F23=\"\",\"\",Inventory!F23)","v":""},{"$f":"IF(Inventory!H23=\"\",\"\",Inventory!H23)","v":""},{"$f":"IF(Inventory!G23=\"\",\"\",Inventory!G23)","v":""},{"$f":"IF(Inventory!I23=\"\",\"\",Inventory!I23)","v":""},{"$f":"IF(Inventory!J23=\"\",\"\",Inventory!J23)","v":""},{"$f":"IF(Inventory!K23=\"\",\"\",Inventory!K23)","v":""},{"$f":"IF(Inventory!L23=\"\",\"\",Inventory!L23)","v":""},{"$f":"IF(Inventory!M23=\"\",\"\",Inventory!M23)","v":""},{"$f":"IF(Inventory!N23=\"\",\"\",Inventory!N23)","v":""},{"$f":"IF(Inventory!P23=\"\",\"\",Inventory!P23)","v":""},{"$f":"IF(Inventory!R23=\"\",\"\",Inventory!R23)","v":""},{"$f":"IF(Inventory!Q23=\"\",\"\",Inventory!Q23)","v":""},{"$f":"IF(Inventory!U23=\"\",\"\",Inventory!U23)","v":""},{"$f":"IF(Inventory!V23=\"\",\"\",Inventory!V23)","v":""},{"$f":"IF(Inventory!AF23=\"\",\"\",Inventory!AF23)","v":""},{"$f":"IF(Inventory!X23=\"\",\"\",Inventory!X23)","v":""},{"$f":"IF(Inventory!Y23=\"\",\"\",Inventory!Y23)","v":""},{"$f":"IF(Inventory!Z23=\"\",\"\",Inventory!Z23)","v":""},0]
[null,17,{"$f":"IF(Inventory!B24=\"\",\"\",Inventory!B24)","v":""},{"$f":"IF(Inventory!C24=\"\",\"\",Inventory!C24)","v":""},{"$f":"IF(Inventory!D24=\"\",\"\",Inventory!D24)","v":""},{"$f":"IF(Inventory!F24=\"\",\"\",Inventory!F24)","v":""},{"$f":"IF(Inventory!H24=\"\",\"\",Inventory!H24)","v":""},{"$f":"IF(Inventory!G24=\"\",\"\",Inventory!G24)","v":""},{"$f":"IF(Inventory!I24=\"\",\"\",Inventory!I24)","v":""},{"$f":"IF(Inventory!J24=\"\",\"\",Inventory!J24)","v":""},{"$f":"IF(Inventory!K24=\"\",\"\",Inventory!K24)","v":""},{"$f":"IF(Inventory!L24=\"\",\"\",Inventory!L24)","v":""},{"$f":"IF(Inventory!M24=\"\",\"\",Inventory!M24)","v":""},{"$f":"IF(Inventory!N24=\"\",\"\",Inventory!N24)","v":""},{"$f":"IF(Inventory!P24=\"\",\"\",Inventory!P24)","v":""},{"$f":"IF(Inventory!R24=\"\",\"\",Inventory!R24)","v":""},{"$f":"IF(Inventory!Q24=\"\",\"\",Inventory!Q24)","v":""},{"$f":"IF(Inventory!U24=\"\",\"\",Inventory!U24)","v":""},{"$f":"IF(Inventory!V24=\"\",\"\",Inventory!V24)","v":""},{"$f":"IF(Inventory!AF24=\"\",\"\",Inventory!AF24)","v":""},{"$f":"IF(Inventory!X24=\"\",\"\",Inventory!X24)","v":""},{"$f":"IF(Inventory!Y24=\"\",\"\",Inventory!Y24)","v":""},{"$f":"IF(Inventory!Z24=\"\",\"\",Inventory!Z24)","v":""},0]
[null,18,{"$f":"IF(Inventory!B25=\"\",\"\",Inventory!B25)","v":""},{"$f":"IF(Inventory!C25=\"\",\"\",Inventory!C25)","v":""},{"$f":"IF(Inventory!D25=\"\",\"\",Inventory!D25)","v":""},{"$f":"IF(Inventory!F25=\"\",\"\",Inventory!F25)","v":""},{"$f":"IF(Inventory!H25=\"\",\"\",Inventory!H25)","v":""},{"$f":"IF(Inventory!G25=\"\",\"\",Inventory!G25)","v":""},{"$f":"IF(Inventory!I25=\"\",\"\",Inventory!I25)","v":""},{"$f":"IF(Inventory!J25=\"\",\"\",Inventory!J25)","v":""},{"$f":"IF(Inventory!K25=\"\",\"\",Inventory!K25)","v":""},{"$f":"IF(Inventory!L25=\"\",\"\",Inventory!L25)","v":""},{"$f":"IF(Inventory!M25=\"\",\"\",Inventory!M25)","v":""},{"$f":"IF(Inventory!N25=\"\",\"\",Inventory!N25)","v":""},{"$f":"IF(Inventory!P25=\"\",\"\",Inventory!P25)","v":""},{"$f":"IF(Inventory!R25=\"\",\"\",Inventory!R25)","v":""},{"$f":"IF(Inventory!Q25=\"\",\"\",Inventory!Q25)","v":""},{"$f":"IF(Inventory!U25=\"\",\"\",Inventory!U25)","v":""},{"$f":"IF(Inventory!V25=\"\",\"\",Inventory!V25)","v":""},{"$f":"IF(Inventory!AF25=\"\",\"\",Inventory!AF25)","v":""},{"$f":"IF(Inventory!X25=\"\",\"\",Inventory!X25)","v":""},{"$f":"IF(Inventory!Y25=\"\",\"\",Inventory!Y25)","v":""},{"$f":"IF(Inventory!Z25=\"\",\"\",Inventory!Z25)","v":""},0]
[null,19,{"$f":"IF(Inventory!B26=\"\",\"\",Inventory!B26)","v":""},{"$f":"IF(Inventory!C26=\"\",\"\",Inventory!C26)","v":""},{"$f":"IF(Inventory!D26=\"\",\"\",Inventory!D26)","v":""},{"$f":"IF(Inventory!F26=\"\",\"\",Inventory!F26)","v":""},{"$f":"IF(Inventory!H26=\"\",\"\",Inventory!H26)","v":""},{"$f":"IF(Inventory!G26=\"\",\"\",Inventory!G26)","v":""},{"$f":"IF(Inventory!I26=\"\",\"\",Inventory!I26)","v":""},{"$f":"IF(Inventory!J26=\"\",\"\",Inventory!J26)","v":""},{"$f":"IF(Inventory!K26=\"\",\"\",Inventory!K26)","v":""},{"$f":"IF(Inventory!L26=\"\",\"\",Inventory!L26)","v":""},{"$f":"IF(Inventory!M26=\"\",\"\",Inventory!M26)","v":""},{"$f":"IF(Inventory!N26=\"\",\"\",Inventory!N26)","v":""},{"$f":"IF(Inventory!P26=\"\",\"\",Inventory!P26)","v":""},{"$f":"IF(Inventory!R26=\"\",\"\",Inventory!R26)","v":""},{"$f":"IF(Inventory!Q26=\"\",\"\",Inventory!Q26)","v":""},{"$f":"IF(Inventory!U26=\"\",\"\",Inventory!U26)","v":""},{"$f":"IF(Inventory!V26=\"\",\"\",Inventory!V26)","v":""},{"$f":"IF(Inventory!AF26=\"\",\"\",Inventory!AF26)","v":""},{"$f":"IF(Inventory!X26=\"\",\"\",Inventory!X26)","v":""},{"$f":"IF(Inventory!Y26=\"\",\"\",Inventory!Y26)","v":""},{"$f":"IF(Inventory!Z26=\"\",\"\",Inventory!Z26)","v":""},0]
[null,20,{"$f":"IF(Inventory!B27=\"\",\"\",Inventory!B27)","v":""},{"$f":"IF(Inventory!C27=\"\",\"\",Inventory!C27)","v":""},{"$f":"IF(Inventory!D27=\"\",\"\",Inventory!D27)","v":""},{"$f":"IF(Inventory!F27=\"\",\"\",Inventory!F27)","v":""},{"$f":"IF(Inventory!H27=\"\",\"\",Inventory!H27)","v":""},{"$f":"IF(Inventory!G27=\"\",\"\",Inventory!G27)","v":""},{"$f":"IF(Inventory!I27=\"\",\"\",Inventory!I27)","v":""},{"$f":"IF(Inventory!J27=\"\",\"\",Inventory!J27)","v":""},{"$f":"IF(Inventory!K27=\"\",\"\",Inventory!K27)","v":""},{"$f":"IF(Inventory!L27=\"\",\"\",Inventory!L27)","v":""},{"$f":"IF(Inventory!M27=\"\",\"\",Inventory!M27)","v":""},{"$f":"IF(Inventory!N27=\"\",\"\",Inventory!N27)","v":""},{"$f":"IF(Inventory!P27=\"\",\"\",Inventory!P27)","v":""},{"$f":"IF(Inventory!R27=\"\",\"\",Inventory!R27)","v":""},{"$f":"IF(Inventory!Q27=\"\",\"\",Inventory!Q27)","v":""},{"$f":"IF(Inventory!U27=\"\",\"\",Inventory!U27)","v":""},{"$f":"IF(Inventory!V27=\"\",\"\",Inventory!V27)","v":""},{"$f":"IF(Inventory!AF27=\"\",\"\",Inventory!AF27)","v":""},{"$f":"IF(Inventory!X27=\"\",\"\",Inventory!X27)","v":""},{"$f":"IF(Inventory!Y27=\"\",\"\",Inventory!Y27)","v":""},{"$f":"IF(Inventory!Z27=\"\",\"\",Inventory!Z27)","v":""},0]
[null,21,{"$f":"IF(Inventory!B28=\"\",\"\",Inventory!B28)","v":""},{"$f":"IF(Inventory!C28=\"\",\"\",Inventory!C28)","v":""},{"$f":"IF(Inventory!D28=\"\",\"\",Inventory!D28)","v":""},{"$f":"IF(Inventory!F28=\"\",\"\",Inventory!F28)","v":""},{"$f":"IF(Inventory!H28=\"\",\"\",Inventory!H28)","v":""},{"$f":"IF(Inventory!G28=\"\",\"\",Inventory!G28)","v":""},{"$f":"IF(Inventory!I28=\"\",\"\",Inventory!I28)","v":""},{"$f":"IF(Inventory!J28=\"\",\"\",Inventory!J28)","v":""},{"$f":"IF(Inventory!K28=\"\",\"\",Inventory!K28)","v":""},{"$f":"IF(Inventory!L28=\"\",\"\",Inventory!L28)","v":""},{"$f":"IF(Inventory!M28=\"\",\"\",Inventory!M28)","v":""},{"$f":"IF(Inventory!N28=\"\",\"\",Inventory!N28)","v":""},{"$f":"IF(Inventory!P28=\"\",\"\",Inventory!P28)","v":""},{"$f":"IF(Inventory!R28=\"\",\"\",Inventory!R28)","v":""},{"$f":"IF(Inventory!Q28=\"\",\"\",Inventory!Q28)","v":""},{"$f":"IF(Inventory!U28=\"\",\"\",Inventory!U28)","v":""},{"$f":"IF(Inventory!V28=\"\",\"\",Inventory!V28)","v":""},{"$f":"IF(Inventory!AF28=\"\",\"\",Inventory!AF28)","v":""},{"$f":"IF(Inventory!X28=\"\",\"\",Inventory!X28)","v":""},{"$f":"IF(Inventory!Y28=\"\",\"\",Inventory!Y28)","v":""},{"$f":"IF(Inventory!Z28=\"\",\"\",Inventory!Z28)","v":""},0]
[null,22,{"$f":"IF(Inventory!B29=\"\",\"\",Inventory!B29)","v":""},{"$f":"IF(Inventory!C29=\"\",\"\",Inventory!C29)","v":""},{"$f":"IF(Inventory!D29=\"\",\"\",Inventory!D29)","v":""},{"$f":"IF(Inventory!F29=\"\",\"\",Inventory!F29)","v":""},{"$f":"IF(Inventory!H29=\"\",\"\",Inventory!H29)","v":""},{"$f":"IF(Inventory!G29=\"\",\"\",Inventory!G29)","v":""},{"$f":"IF(Inventory!I29=\"\",\"\",Inventory!I29)","v":""},{"$f":"IF(Inventory!J29=\"\",\"\",Inventory!J29)","v":""},{"$f":"IF(Inventory!K29=\"\",\"\",Inventory!K29)","v":""},{"$f":"IF(Inventory!L29=\"\",\"\",Inventory!L29)","v":""},{"$f":"IF(Inventory!M29=\"\",\"\",Inventory!M29)","v":""},{"$f":"IF(Inventory!N29=\"\",\"\",Inventory!N29)","v":""},{"$f":"IF(Inventory!P29=\"\",\"\",Inventory!P29)","v":""},{"$f":"IF(Inventory!R29=\"\",\"\",Inventory!R29)","v":""},{"$f":"IF(Inventory!Q29=\"\",\"\",Inventory!Q29)","v":""},{"$f":"IF(Inventory!U29=\"\",\"\",Inventory!U29)","v":""},{"$f":"IF(Inventory!V29=\"\",\"\",Inventory!V29)","v":""},{"$f":"IF(Inventory!AF29=\"\",\"\",Inventory!AF29)","v":""},{"$f":"IF(Inventory!X29=\"\",\"\",Inventory!X29)","v":""},{"$f":"IF(Inventory!Y29=\"\",\"\",Inventory!Y29)","v":""},{"$f":"IF(Inventory!Z29=\"\",\"\",Inventory!Z29)","v":""},0]
[null,23,{"$f":"IF(Inventory!B30=\"\",\"\",Inventory!B30)","v":""},{"$f":"IF(Inventory!C30=\"\",\"\",Inventory!C30)","v":""},{"$f":"IF(Inventory!D30=\"\",\"\",Inventory!D30)","v":""},{"$f":"IF(Inventory!F30=\"\",\"\",Inventory!F30)","v":""},{"$f":"IF(Inventory!H30=\"\",\"\",Inventory!H30)","v":""},{"$f":"IF(Inventory!G30=\"\",\"\",Inventory!G30)","v":""},{"$f":"IF(Inventory!I30=\"\",\"\",Inventory!I30)","v":""},{"$f":"IF(Inventory!J30=\"\",\"\",Inventory!J30)","v":""},{"$f":"IF(Inventory!K30=\"\",\"\",Inventory!K30)","v":""},{"$f":"IF(Inventory!L30=\"\",\"\",Inventory!L30)","v":""},{"$f":"IF(Inventory!M30=\"\",\"\",Inventory!M30)","v":""},{"$f":"IF(Inventory!N30=\"\",\"\",Inventory!N30)","v":""},{"$f":"IF(Inventory!P30=\"\",\"\",Inventory!P30)","v":""},{"$f":"IF(Inventory!R30=\"\",\"\",Inventory!R30)","v":""},{"$f":"IF(Inventory!Q30=\"\",\"\",Inventory!Q30)","v":""},{"$f":"IF(Inventory!U30=\"\",\"\",Inventory!U30)","v":""},{"$f":"IF(Inventory!V30=\"\",\"\",Inventory!V30)","v":""},{"$f":"IF(Inventory!AF30=\"\",\"\",Inventory!AF30)","v":""},{"$f":"IF(Inventory!X30=\"\",\"\",Inventory!X30)","v":""},{"$f":"IF(Inventory!Y30=\"\",\"\",Inventory!Y30)","v":""},{"$f":"IF(Inventory!Z30=\"\",\"\",Inventory!Z30)","v":""},0]
[null,24,{"$f":"IF(Inventory!B31=\"\",\"\",Inventory!B31)","v":""},{"$f":"IF(Inventory!C31=\"\",\"\",Inventory!C31)","v":""},{"$f":"IF(Inventory!D31=\"\",\"\",Inventory!D31)","v":""},{"$f":"IF(Inventory!F31=\"\",\"\",Inventory!F31)","v":""},{"$f":"IF(Inventory!H31=\"\",\"\",Inventory!H31)","v":""},{"$f":"IF(Inventory!G31=\"\",\"\",Inventory!G31)","v":""},{"$f":"IF(Inventory!I31=\"\",\"\",Inventory!I31)","v":""},{"$f":"IF(Inventory!J31=\"\",\"\",Inventory!J31)","v":""},{"$f":"IF(Inventory!K31=\"\",\"\",Inventory!K31)","v":""},{"$f":"IF(Inventory!L31=\"\",\"\",Inventory!L31)","v":""},{"$f":"IF(Inventory!M31=\"\",\"\",Inventory!M31)","v":""},{"$f":"IF(Inventory!N31=\"\",\"\",Inventory!N31)","v":""},{"$f":"IF(Inventory!P31=\"\",\"\",Inventory!P31)","v":""},{"$f":"IF(Inventory!R31=\"\",\"\",Inventory!R31)","v":""},{"$f":"IF(Inventory!Q31=\"\",\"\",Inventory!Q31)","v":""},{"$f":"IF(Inventory!U31=\"\",\"\",Inventory!U31)","v":""},{"$f":"IF(Inventory!V31=\"\",\"\",Inventory!V31)","v":""},{"$f":"IF(Inventory!AF31=\"\",\"\",Inventory!AF31)","v":""},{"$f":"IF(Inventory!X31=\"\",\"\",Inventory!X31)","v":""},{"$f":"IF(Inventory!Y31=\"\",\"\",Inventory!Y31)","v":""},{"$f":"IF(Inventory!Z31=\"\",\"\",Inventory!Z31)","v":""},0]
[null,25,{"$f":"IF(Inventory!B32=\"\",\"\",Inventory!B32)","v":""},{"$f":"IF(Inventory!C32=\"\",\"\",Inventory!C32)","v":""},{"$f":"IF(Inventory!D32=\"\",\"\",Inventory!D32)","v":""},{"$f":"IF(Inventory!F32=\"\",\"\",Inventory!F32)","v":""},{"$f":"IF(Inventory!H32=\"\",\"\",Inventory!H32)","v":""},{"$f":"IF(Inventory!G32=\"\",\"\",Inventory!G32)","v":""},{"$f":"IF(Inventory!I32=\"\",\"\",Inventory!I32)","v":""},{"$f":"IF(Inventory!J32=\"\",\"\",Inventory!J32)","v":""},{"$f":"IF(Inventory!K32=\"\",\"\",Inventory!K32)","v":""},{"$f":"IF(Inventory!L32=\"\",\"\",Inventory!L32)","v":""},{"$f":"IF(Inventory!M32=\"\",\"\",Inventory!M32)","v":""},{"$f":"IF(Inventory!N32=\"\",\"\",Inventory!N32)","v":""},{"$f":"IF(Inventory!P32=\"\",\"\",Inventory!P32)","v":""},{"$f":"IF(Inventory!R32=\"\",\"\",Inventory!R32)","v":""},{"$f":"IF(Inventory!Q32=\"\",\"\",Inventory!Q32)","v":""},{"$f":"IF(Inventory!U32=\"\",\"\",Inventory!U32)","v":""},{"$f":"IF(Inventory!V32=\"\",\"\",Inventory!V32)","v":""},{"$f":"IF(Inventory!AF32=\"\",\"\",Inventory!AF32)","v":""},{"$f":"IF(Inventory!X32=\"\",\"\",Inventory!X32)","v":""},{"$f":"IF(Inventory!Y32=\"\",\"\",Inventory!Y32)","v":""},{"$f":"IF(Inventory!Z32=\"\",\"\",Inventory!Z32)","v":""},0]
[null,null,null,null,null,null,null,null,null,null,null,null,null,null,null,null,null,null,null,null,null,null,{"$f":"SUM(X6:X30)","v":0}]

{"sheet":"Building Types","index":6,"n_rows":72,"n_cols":10,"rows_kept":72,"cut":false,"hidden":true,"merged":[[57,9,68,9],[69,9,71,9],[57,5,68,5],[57,6,68,6],[21,9,23,9],[26,9,30,9],[31,9,32,9],[33,9,42,9],[45,9,54,9],[57,7,68,7],[69,7,71,7],[21,8,23,8],[26,8,30,8],[31,8,32,8],[33,8,42,8],[45,8,54,8],[1,9,3,9],[4,9,5,9],[6,9,8,9],[15,9,16,9],[17,9,19,9],[1,8,3,8],[4,8,5,8],[6,8,8,8],[15,8,16,8],[17,8,19,8],[57,8,68,8],[69,8,71,8],[21,7,23,7],[26,7,30,7],[31,7,32,7],[33,7,42,7],[45,7,54,7],[1,7,3,7],[4,7,5,7],[6,7,8,7],[15,7,16,7],[17,7,19,7],[1,6,3,6],[45,6,54,6],[69,6,71,6],[33,6,42,6],[31,6,32,6],[26,6,30,6],[21,6,23,6],[17,6,19,6],[15,6,16,6],[6,6,8,6],[4,6,5,6],[26,5,30,5],[31,5,32,5],[33,5,42,5],[45,5,54,5],[69,5,71,5],[1,5,3,5],[4,5,5,5],[6,5,8,5],[15,5,16,5],[17,5,19,5],[21,5,23,5],[57,1,68,1],[57,2,68,2],[57,3,68,3],[69,1,71,1],[69,2,71,2],[69,3,71,3],[33,1,44,1],[33,2,42,2],[33,3,44,3],[45,1,54,1],[45,2,54,2],[45,3,54,3],[21,1,25,1],[21,2,23,2],[21,3,25,3],[11,1,14,1],[11,3,14,3],[26,1,32,1],[26,2,30,2],[26,3,30,3],[31,2,32,2],[31,3,32,3],[15,1,19,1],[15,2,16,2],[15,3,16,3],[17,2,19,2],[17,3,19,3],[9,1,10,1],[9,3,10,3],[1,1,8,1],[1,2,3,2],[1,3,8,3],[4,2,5,2],[6,2,8,2],[11,4,12,4],[13,4,14,4],[11,5,12,5],[13,5,14,5],[11,6,12,6],[13,6,14,6]]}
[1,"Building Type","Principal Building Activity","Definition","Detailed Business Type Examples","Average Floor Area (ft2)","Average # of Floors","Cooling EFLH - \nDX Systems","Cooling EFLH - \nAir-Cooled Chillers","Cooling EFLH - \nWater-Cooled Chillers"]
[null,"Education","College","Buildings used for academic or technical classroom instruction, such as elementary, middle, or high schools, and classroom buildings on college or university campuses. Buildings on education campuses for which the main use is not classroom are included in the category relating to their use. For example, administration buildings are part of \"Office,\" dormitories are \"Lodging,\" and libraries are \"Public Assembly.\"","1) College or University","Not specified","Not specified",2101,2173,3894]
[null,null,null,null,"2) Career or Vocational Training"]
[null,null,null,null,"3) Adult Education"]
[null,null,"Primary School",null,"1) Elementary or Middle School",73960,1,1633,915,1716]
[null,null,null,null,"2) Preschool or Daycare"]
[null,null,"Secondary School",null,"1) High School",210887,2,1429,1477,2647]
[null,null,null,null,"2) Religious Education"]
[]
[null,"Food Sales","Convenience","Buildings used for retail or wholesale of food.","1) Gas Station with a Convenience Store","Not specified",1,2307,"-","-"]
[null,null,"Supermarket",null,"2) Convenience Store",45000,1,829,"-","-"]
[null,"Food Service","Full-Service Restaurant","Buildings used for preparation and sale of food and beverages for consumption.","1) Restaurant or Cafeteria",5500,1,2249,"-","-"]
[null,null,"24-Hr Full Service",null,null,null,null,2548,"-","-"]
[null,null,"Quick-Service Restaurant",null,"1) Fast Food",2500,1,1996,"-","-"]
[null,null,"24-Hr Quick Service",null,null,null,null,2311,"-","-"]
[null,"Healthcare","Hospital","Buildings used as diagnostic and treatment facilities for inpatient care.","1) Hospital",241351,5,3534,3115,4015]
[null,null,null,null,"2) Inpatient Rehabilitation"]
[null,null,"Outpatient Healthcare","Buildings used as diagnostic and treatment facilities for outpatient care. Medical offices are included here if they use any type of diagnostic medical equipment (if they do not, they are categorized as an office building).","1) Medical Office",40946,3,2925,"-","-"]
[null,null,null,null,"2) Clinic or Outpatient Health Care"]
[null,null,null,null,"3) Veterinarian"]
[null,"Large Multifamily","Midrise Apartment","Buildings containing multifamily dwelling units, having multiple stories, and equipped with elevators.","No sub-categories collected.",33740,4,2429,1378,2528]
[null,"Lodging","Large Hotel","Buildings used to offer multiple accommodations for short-term or long-term residents, including skilled nursing and other residential care buildings.","1) Motel or Inn",122120,6,2600,2595,3180]
[null,null,null,null,"2) Hotel"]
[null,null,null,null,"3) Dormitory, Fraternity, or Sorority"]
[null,null,"Nursing Home",null,"4) Retirement Home, Nursing Home, Assisted Living, or other Residential Care","Not specified","Not specified",2467,1400,2568]
[null,null,"Small Hotel/Motel",null,"5) Convent or Monastery",43200,4,2421,"-","-"]
[null,"Mercantile","Stand-Alone Retail","Buildings used for the sale and display of goods other than food.","1) Retail Store",24962,1,1554,1184,1652]
[null,null,null,null,"2) Beer, Wine, or Liquor Store"]
[null,null,null,null,"3) Rental Center"]
[null,null,null,null,"4) Dealership or Showroom for Vehicles or Boats"]
[null,null,null,null,"5) Studio or Gallery"]
[null,null,"Strip Mall","Shopping malls comprised of multiple connected establishments.","1) Strip Shopping Center",22500,1,1467,"-","-"]
[null,null,null,null,"2) Enclosed Malls"]
[null,"Office","Large Office","Buildings used for general office space, professional office, or administrative offices. Medical offices are included here if they do not use any type of diagnostic medical equipment (if they do, they are categorized as an outpatient health care building).","1) Administrative or Professional Office",498588,12,2866,2009,2401]
[null,null,null,null,"2) Government Office"]
[null,null,null,null,"3) Mixed-Use Office"]
[null,null,null,null,"4) Bank or Other Financial Institution"]
[null,null,null,null,"5) Medical Office"]
[null,null,null,null,"6) Sales Office"]
[null,null,null,null,"7) Contractor’s Office (e.g. Construction, Plumbing, HVAC)"]
[null,null,null,null,"8) Non-Profit or Social Services"]
[null,null,null,null,"9) Research and Development"]
[null,null,null,null,"10) City Hall or City Center"]
[null,null,"Medium Office",null,"11) Religious Office",53628,3,1523,2009,2401]
[null,null,"Small Office",null,"12) Call Center",5500,1,1598,"-","-"]
[null,"Public Assembly","Public Assembly ","Buildings in which people gather for social or recreational activities, whether in private or non-private meeting halls.","1) Social or Meeting (e.g. Community Center, Lodge, Meeting Hall, Convention Center, Senior Center)","Not specified","Not specified",2196,1231,2307]
[null,null,null,null,"2) Recreation (e.g. Gymnasium, Health Club, Bowling Alley, Ice Rink, Field House, Indoor Racquet Sports)"]
[null,null,null,null,"3) Entertainment or Culture (e.g. Museum, Theater, Cinema, Sports Arena, Casino, Night Club)"]
[null,null,null,null,"4) Library"]
[null,null,null,null,"5) Funeral Home"]
[null,null,null,null,"6) Student Activities Center"]
[null,null,null,null,"7) Armory"]
[null,null,null,null,"8) Exhibition Hall"]
[null,null,null,null,"9) Broadcasting Studio"]
[null,null,null,null,"10) Transportation Terminal"]
[null,"Religious Worship","Religious Worship","Buildings in which people gather for religious activities, (such as chapels, churches, mosques, synagogues, and temples).","No sub-categories collected.","Not specified","Not specified",602,713,994]
[null,"Other","Other","For building types not explicitly listed","Values used for Other are the most conservative values from the explicitly listed building types","Not specified","Not specified",602,713,994]
[null,"Service","Service","Buildings in which some type of service is provided, other than food service or retail sales of goods.","1) Vehicle Service or Vehicle Repair Shop","Not specified","Not specified",1742,"-","-"]
[null,null,null,null,"2) Vehicle Storage/Maintenance"]
[null,null,null,null,"3) Repair Shop"]
[null,null,null,null,"4) Dry Cleaner or Laundromat"]
[null,null,null,null,"5) Post Office or Postal Center"]
[null,null,null,null,"6) Car Wash"]
[null,null,null,null,"7) Gas Station with no Convenience Store"]
[null,null,null,null,"8) Photo Processing Shop"]
[null,null,null,null,"9) Beauty Parlor or Barber Shop"]
[null,null,null,null,"10) Tanning Salon"]
[null,null,null,null,"11) Copy Center or Printing Shop"]
[null,null,null,null,"12) Kennel"]
[null,"Warehouse","Warehouse","Buildings used to store goods, manufactured products, merchandise, raw materials, or personal belongings (such as self-storage).","1) Refrigerated Warehouse",52045,1,718,"-","-"]
[null,null,null,null,"2) Non-refrigerated warehouse"]
[null,null,null,null,"3) Distribution or Shipping Center"]

{"sheet":"Unitary","index":7,"n_rows":36,"n_cols":106,"rows_kept":36,"cut":false,"hidden":true,"merged":[]}
[null,null,null,"UnitaryAirConditioner",null,null,null,"UnitaryAirConditioner",null,null,null,"UnitaryAirConditioner",null,null,null,"UnitaryAirConditioner",null,null,null,"UnitaryAirConditioner",null,null,null,"UnitaryAirConditioner",null,null,null,"UnitaryAirConditioner",null,null,null,"UnitaryAirConditioner",null,null,null,"UnitaryAirConditioner",null,null,null,"UnitaryAirConditioner",null,null,null,null,null,"UnitaryHeatPump",null,null,null,null,null,{"$f":"$AT$1","v":"UnitaryHeatPump"},null,null,null,null,null,{"$f":"$AT$1","v":"UnitaryHeatPump"},null,null,null,null,null,{"$f":"$AT$1","v":"UnitaryHeatPump"},null,null,null,null,null,{"$f":"$AT$1","v":"UnitaryHeatPump"},null,null,null,null,null,{"$f":"$AT$1","v":"UnitaryHeatPump"},null,null,null,null,null,{"$f":"$AT$1","v":"UnitaryHeatPump"},null,null,null,null,null,{"$f":"$AT$1","v":"UnitaryHeatPump"},null,null,null,null,null,{"$f":"$AT$1","v":"UnitaryHeatPump"},null,null,null,null,null,{"$f":"$AT$1","v":"UnitaryHeatPump"}]
[null,null,null,"Split",null,null,null,"Packaged",null,null,null,"ElecResorNone",null,null,null,"Other",null,null,null,"ElecResorNone",null,null,null,"Other",null,null,null,"ElecResorNone",null,null,null,"Other",null,null,null,"ElecResorNone",null,null,null,"Other",null,null,null,null,null,"Split",null,null,null,null,null,"Packaged",null,null,null,null,null,"ElecResorNone",null,null,null,null,null,"Other",null,null,null,null,null,"ElecResorNone",null,null,null,null,null,"Other",null,null,null,null,null,"ElecResorNone",null,null,null,null,null,"Other",null,null,null,null,null,"ElecResorNone",null,null,null,null,null,"Other"]
[null,null,null,"Lessthan65kbtuh",null,null,null,"Lessthan65kbtuh",null,null,null,"65to135kbtuh",null,null,null,"65to135kbtuh",null,null,null,"135to240kbtuh",null,null,null,"135to240kbtuh",null,null,null,"240to760kbtuh",null,null,null,"240to760kbtuh",null,null,null,"Greaterthan760kbtuh",null,null,null,"Greaterthan760kbtuh",null,null,null,null,null,"Lessthan65kbtuh",null,null,null,null,null,"Lessthan65kbtuh",null,null,null,null,null,"65to135kbtuh",null,null,null,null,null,"65to135kbtuh",null,null,null,null,null,"135to240kbtuh",null,null,null,null,null,"135to240kbtuh",null,null,null,null,null,"240to760kbtuh",null,null,null,null,null,"240to760kbtuh",null,null,null,null,null,"Greaterthan760kbtuh",null,null,null,null,null,"Greaterthan760kbtuh"]
[null,null,null,{"$f":"D1&D2&D3","v":"UnitaryAirConditionerSplitLessthan65kbtuh"},null,null,null,{"$f":"H1&H2&H3","v":"UnitaryAirConditionerPackagedLessthan65kbtuh"},null,null,null,{"$f":"L1&L2&L3","v":"UnitaryAirConditionerElecResorNone65to135kbtuh"},null,null,null,{"$f":"P1&P2&P3","v":"UnitaryAirConditionerOther65to135kbtuh"},null,null,null,{"$f":"T1&T2&T3","v":"UnitaryAirConditionerElecResorNone135to240kbtuh"},null,null,null,{"$f":"X1&X2&X3","v":"UnitaryAirConditionerOther135to240kbtuh"},null,null,null,{"$f":"AB1&AB2&AB3","v":"UnitaryAirConditionerElecResorNone240to760kbtuh"},null,null,null,{"$f":"AF1&AF2&AF3","v":"UnitaryAirConditionerOther240to760kbtuh"},null,null,null,{"$f":"AJ1&AJ2&AJ3","v":"UnitaryAirConditionerElecResorNoneGreaterthan760kbtuh"},null,null,null,{"$f":"AN1&AN2&AN3","v":"UnitaryAirConditionerOtherGreaterthan760kbtuh"},null,null,null,null,null,{"$f":"AT1&AT2&AT3","v":"UnitaryHeatPumpSplitLessthan65kbtuh"},null,null,null,null,null,{"$f":"AZ1&AZ2&AZ3","v":"UnitaryHeatPumpPackagedLessthan65kbtuh"},null,null,null,null,null,{"$f":"BF1&BF2&BF3","v":"UnitaryHeatPumpElecResorNone65to135kbtuh"},null,null,null,null,null,{"$f":"BL1&BL2&BL3","v":"UnitaryHeatPumpOther65to135kbtuh"},null,null,null,null,null,{"$f":"BR1&BR2&BR3","v":"UnitaryHeatPumpElecResorNone135to240kbtuh"},null,null,null,null,null,{"$f":"BX1&BX2&BX3","v":"UnitaryHeatPumpOther135to240kbtuh"},null,null,null,null,null,{"$f":"CD1&CD2&CD3","v":"UnitaryHeatPumpElecResorNone240to760kbtuh"},null,null,null,null,null,{"$f":"CJ1&CJ2&CJ3","v":"UnitaryHeatPumpOther240to760kbtuh"},null,null,null,null,null,{"$f":"CP1&CP2&CP3","v":"UnitaryHeatPumpElecResorNoneGreaterthan760kbtuh"},null,null,null,null,null,{"$f":"CV1&CV2&CV3","v":"UnitaryHeatPumpOtherGreaterthan760kbtuh"}]
["BaselineRow",null,"Manuf. Year","EER","SEER","Full Load","Part Load","EER","SEER","Full Load","Part Load","EER","IEER","Full Load","Part Load","EER","IEERadj","Full Load","Part Load","EER","IEERadj","Full Load","Part Load","EER","IEERadj","Full Load","Part Load","EER","IEERadj","Full Load","Part Load","EER","IEERadj","Full Load","Part Load","EER","IEERadj","Full Load","Part Load","EER","IEERadj","Full Load","Part Load","Applicable Standard",null,"EER","SEERadj","HSPF","Full Load","Part Load","Heating","EER","SEERadj","HSPF","Full Load","Part Load","Heating","EER","IEER","COP","Full Load","Part Load","Heating","EER","IEERadj","COP","Full Load","Part Load","Heating","EER","IEERadj","COP","Full Load","Part Load","Heating","EER","IEERadj","COP","Full Load","Part Load","Heating","EER","IEERadj","COP","Full Load","Part Load","Heating","EER","IEERadj","COP","Full Load","Part Load","Heating","EER","IEERadj","COP","Full Load","Part Load","Heating","EER","IEERadj","COP","Full Load","Part Load","Heating","Applicable Standard"]
[1990,null,1990,9.1999999999999993,10,{"$f":"12/D6","v":1.3043478260869565},{"$f":"12/E6","v":1.2},9,9.6999999999999993,{"$f":"12/H6","v":1.3333333333333333},{"$f":"12/I6","v":1.2371134020618557},8.9,9.1,{"$f":"12/L6","v":1.348314606741573},{"$f":"12/M6","v":1.3186813186813187},{"$f":"L6","v":8.9},{"$f":"M6","v":9.1},{"$f":"12/P6","v":1.348314606741573},{"$f":"12/Q6","v":1.3186813186813187},8,8.1999999999999993,{"$f":"12/T6","v":1.5},{"$f":"12/U6","v":1.4634146341463417},{"$f":"T6","v":8},{"$f":"U6","v":8.1999999999999993},{"$f":"12/X6","v":1.5},{"$f":"12/Y6","v":1.4634146341463417},8,8.1,{"$f":"12/AB6","v":1.5},{"$f":"12/AC6","v":1.4814814814814816},{"$f":"AB6","v":8},{"$f":"AC6","v":8.1},{"$f":"12/AF6","v":1.5},{"$f":"12/AG6","v":1.4814814814814816},7.8,7.8999999999999995,{"$f":"12/AJ6","v":1.5384615384615385},{"$f":"12/AK6","v":1.518987341772152},{"$f":"AJ6","v":7.8},{"$f":"AK6","v":7.8999999999999995},{"$f":"12/AN6","v":1.5384615384615385},{"$f":"12/AO6","v":1.518987341772152},"ASHRAE 90.1--1989",null,9.1999999999999993,10,6.8,{"$f":"12/AT6","v":1.3043478260869565},{"$f":"12/AU6","v":1.2},{"$f":"12/AV6","v":1.7647058823529411},9,9.6999999999999993,6.6,{"$f":"12/AZ6","v":1.3333333333333333},{"$f":"12/BA6","v":1.2371134020618557},{"$f":"12/BB6","v":1.8181818181818183},8.9,9.1,3,{"$f":"12/BF6","v":1.348314606741573},{"$f":"12/BG6","v":1.3186813186813187},{"$f":"12/3.412/BH6","v":1.1723329425556859},{"$f":"BF6","v":8.9},{"$f":"BG6","v":9.1},{"$f":"BH6","v":3},{"$f":"12/BL6","v":1.348314606741573},{"$f":"12/BM6","v":1.3186813186813187},{"$f":"12/3.412/BN6","v":1.1723329425556859},8,8.1,3,{"$f":"12/BR6","v":1.5},{"$f":"12/BS6","v":1.4814814814814816},{"$f":"12/3.412/BT6","v":1.1723329425556859},{"$f":"BR6","v":8},{"$f":"BS6","v":8.1},{"$f":"BT6","v":3},{"$f":"12/BX6","v":1.5},{"$f":"12/BY6","v":1.4814814814814816},{"$f":"12/3.412/BZ6","v":1.1723329425556859},8,8.1,3,{"$f":"12/CD6","v":1.5},{"$f":"12/CE6","v":1.4814814814814816},{"$f":"12/3.412/CF6","v":1.1723329425556859},{"$f":"CD6","v":8},{"$f":"CE6","v":8.1},{"$f":"CF6","v":3},{"$f":"12/CJ6","v":1.5},{"$f":"12/CK6","v":1.4814814814814816},{"$f":"12/3.412/CL6","v":1.1723329425556859},7.8,7.9,3,{"$f":"12/CP6","v":1.5384615384615385},{"$f":"12/CQ6","v":1.5189873417721518},{"$f":"12/3.412/CR6","v":1.1723329425556859},{"$f":"CP6","v":7.8},{"$f":"CQ6","v":7.9},{"$f":"CR6","v":3},{"$f":"12/CV6","v":1.5384615384615385},{"$f":"12/CW6","v":1.5189873417721518},{"$f":"12/3.412/CX6","v":1.1723329425556859},"ASHRAE 90.1--1989"]
[1991,null,1991,9.1999999999999993,10,1.3043478260869565,1.2,9,9.6999999999999993,1.3333333333333333,1.2371134020618557,8.9,9.1,1.348314606741573,1.3186813186813187,{"$f":"L7","v":8.9},{"$f":"M7","v":9.1},1.348314606741573,1.3186813186813187,8,8.1999999999999993,1.5,1.4634146341463417,{"$f":"T7","v":8},{"$f":"U7","v":8.1999999999999993},1.5,1.4634146341463417,8,8.1,1.5,1.4814814814814816,{"$f":"AB7","v":8},{"$f":"AC7","v":8.1},1.5,1.4814814814814816,7.8,7.8999999999999995,1.5384615384615385,1.518987341772152,{"$f":"AJ7","v":7.8},{"$f":"AK7","v":7.8999999999999995},1.5384615384615385,1.518987341772152,"ASHRAE 90.1--1989",null,9.1999999999999993,10,6.8,{"$f":"12/AT7","v":1.3043478260869565},{"$f":"12/AU7","v":1.2},{"$f":"12/AV7","v":1.7647058823529411},9,9.6999999999999993,6.6,{"$f":"12/AZ7","v":1.3333333333333333},{"$f":"12/BA7","v":1.2371134020618557},{"$f":"12/BB7","v":1.8181818181818183},8.9,9.1,3,{"$f":"12/BF7","v":1.348314606741573},{"$f":"12/BG7","v":1.3186813186813187},1.1723329425556859,{"$f":"BF7","v":8.9},{"$f":"BG7","v":9.1},{"$f":"BH7","v":3},{"$f":"12/BL7","v":1.348314606741573},{"$f":"12/BM7","v":1.3186813186813187},1.1723329425556859,8,8.1,3,{"$f":"12/BR7","v":1.5},{"$f":"12/BS7","v":1.4814814814814816},1.1723329425556859,{"$f":"BR7","v":8},{"$f":"BS7","v":8.1},{"$f":"BT7","v":3},{"$f":"12/BX7","v":1.5},{"$f":"12/BY7","v":1.4814814814814816},1.1723329425556859,8,8.1,3,{"$f":"12/CD7","v":1.5},{"$f":"12/CE7","v":1.4814814814814816},1.1723329425556859,{"$f":"CD7","v":8},{"$f":"CE7","v":8.1},{"$f":"CF7","v":3},{"$f":"12/CJ7","v":1.5},{"$f":"12/CK7","v":1.4814814814814816},1.1723329425556859,7.8,7.9,3,{"$f":"12/CP7","v":1.5384615384615385},{"$f":"12/CQ7","v":1.5189873417721518},1.1723329425556859,{"$f":"CP7","v":7.8},{"$f":"CQ7","v":7.9},{"$f":"CR7","v":3},{"$f":"12/CV7","v":1.5384615384615385},{"$f":"12/CW7","v":1.5189873417721518},1.1723329425556859,"ASHRAE 90.1--1989"]
[1992,null,1992,9.1999999999999993,10,1.3043478260869565,1.2,9,9.6999999999999993,1.3333333333333333,1.2371134020618557,8.9,9.1,1.348314606741573,1.3186813186813187,8.9,9.1,1.348314606741573,1.3186813186813187,8.3000000000000007,8.5,1.4457831325301203,1.411764705882353,8.3000000000000007,8.5,1.4457831325301203,1.411764705882353,8.3000000000000007,8.4,1.4457831325301203,1.4285714285714286,8.3000000000000007,8.4,1.4457831325301203,1.4285714285714286,8,8.1,1.5,1.4814814814814816,8,8.1,1.5,1.4814814814814816,"ASHRAE 90.1--1989 (as of Jan. 1, 1992) ",null,9.1999999999999993,10,6.8,1.3043478260869565,1.2,1.7647058823529411,9,9.6999999999999993,6.6,1.3333333333333333,1.2371134020618557,1.8181818181818183,8.9,9.1,3,1.348314606741573,1.3186813186813187,1.1723329425556859,8.9,9.1,3,1.348314606741573,1.3186813186813187,1.1723329425556859,8.3000000000000007,8.4,2.9,1.4457831325301203,1.4285714285714286,1.2127582164369164,8.3000000000000007,8.4,2.9,1.4457831325301203,1.4285714285714286,1.2127582164369164,8.3000000000000007,8.4,2.9,1.4457831325301203,1.4285714285714286,1.2127582164369164,8.3000000000000007,8.4,2.9,1.4457831325301203,1.4285714285714286,1.2127582164369164,8.5,8.6,2.9,1.411764705882353,1.3953488372093024,1.2127582164369164,8.5,8.6,2.9,1.411764705882353,1.3953488372093024,1.2127582164369164,"ASHRAE 90.1--1989 (as of Jan. 1, 1992) "]
[1993,null,1993,9.1999999999999993,10,1.3043478260869565,1.2,9,9.6999999999999993,1.3333333333333333,1.2371134020618557,8.9,9.1,1.348314606741573,1.3186813186813187,8.9,9.1,1.348314606741573,1.3186813186813187,8.3000000000000007,8.5,1.4457831325301203,1.411764705882353,8.3000000000000007,8.5,1.4457831325301203,1.411764705882353,8.3000000000000007,8.4,1.4457831325301203,1.4285714285714286,8.3000000000000007,8.4,1.4457831325301203,1.4285714285714286,8,8.1,1.5,1.4814814814814816,8,8.1,1.5,1.4814814814814816,"ASHRAE 90.1--1989 (as of Jan. 1, 1992) ",null,9.1999999999999993,10,6.8,1.3043478260869565,1.2,1.7647058823529411,9,9.6999999999999993,6.6,1.3333333333333333,1.2371134020618557,1.8181818181818183,8.9,9.1,3,1.348314606741573,1.3186813186813187,1.1723329425556859,8.9,9.1,3,1.348314606741573,1.3186813186813187,1.1723329425556859,8.3000000000000007,8.4,2.9,1.4457831325301203,1.4285714285714286,1.2127582164369164,8.3000000000000007,8.4,2.9,1.4457831325301203,1.4285714285714286,1.2127582164369164,8.3000000000000007,8.4,2.9,1.4457831325301203,1.4285714285714286,1.2127582164369164,8.3000000000000007,8.4,2.9,1.4457831325301203,1.4285714285714286,1.2127582164369164,8.5,8.6,2.9,1.411764705882353,1.3953488372093024,1.2127582164369164,8.5,8.6,2.9,1.411764705882353,1.3953488372093024,1.2127582164369164,"ASHRAE 90.1--1989 (as of Jan. 1, 1992) "]
[1994,null,1994,9.1999999999999993,10,1.3043478260869565,1.2,9,9.6999999999999993,1.3333333333333333,1.2371134020618557,8.9,9.1,1.348314606741573,1.3186813186813187,8.9,9.1,1.348314606741573,1.3186813186813187,8.3000000000000007,8.5,1.4457831325301203,1.411764705882353,8.3000000000000007,8.5,1.4457831325301203,1.411764705882353,8.3000000000000007,8.4,1.4457831325301203,1.4285714285714286,8.3000000000000007,8.4,1.4457831325301203,1.4285714285714286,8,8.1,1.5,1.4814814814814816,8,8.1,1.5,1.4814814814814816,"ASHRAE 90.1--1989 (as of Jan. 1, 1992) ",null,9.1999999999999993,10,6.8,1.3043478260869565,1.2,1.7647058823529411,9,9.6999999999999993,6.6,1.3333333333333333,1.2371134020618557,1.8181818181818183,8.9,9.1,3,1.348314606741573,1.3186813186813187,1.1723329425556859,8.9,9.1,3,1.348314606741573,1.3186813186813187,1.1723329425556859,8.3000000000000007,8.4,2.9,1.4457831325301203,1.4285714285714286,1.2127582164369164,8.3000000000000007,8.4,2.9,1.4457831325301203,1.4285714285714286,1.2127582164369164,8.3000000000000007,8.4,2.9,1.4457831325301203,1.4285714285714286,1.2127582164369164,8.3000000000000007,8.4,2.9,1.4457831325301203,1.4285714285714286,1.2127582164369164,8.5,8.6,2.9,1.411764705882353,1.3953488372093024,1.2127582164369164,8.5,8.6,2.9,1.411764705882353,1.3953488372093024,1.2127582164369164,"ASHRAE 90.1--1989 (as of Jan. 1, 1992) "]
[1995,null,1995,9.1999999999999993,10,1.3043478260869565,1.2,9,9.6999999999999993,1.3333333333333333,1.2371134020618557,8.9,9.1,1.348314606741573,1.3186813186813187,8.9,9.1,1.348314606741573,1.3186813186813187,8.3000000000000007,8.5,1.4457831325301203,1.411764705882353,8.3000000000000007,8.5,1.4457831325301203,1.411764705882353,8.3000000000000007,8.4,1.4457831325301203,1.4285714285714286,8.3000000000000007,8.4,1.4457831325301203,1.4285714285714286,8,8.1,1.5,1.4814814814814816,8,8.1,1.5,1.4814814814814816,"ASHRAE 90.1--1989 (as of Jan. 1, 1992) ",null,9.1999999999999993,10,6.8,1.3043478260869565,1.2,1.7647058823529411,9,9.6999999999999993,6.6,1.3333333333333333,1.2371134020618557,1.8181818181818183,8.9,9.1,3,1.348314606741573,1.3186813186813187,1.1723329425556859,8.9,9.1,3,1.348314606741573,1.3186813186813187,1.1723329425556859,8.3000000000000007,8.4,2.9,1.4457831325301203,1.4285714285714286,1.2127582164369164,8.3000000000000007,8.4,2.9,1.4457831325301203,1.4285714285714286,1.2127582164369164,8.3000000000000007,8.4,2.9,1.4457831325301203,1.4285714285714286,1.2127582164369164,8.3000000000000007,8.4,2.9,1.4457831325301203,1.4285714285714286,1.2127582164369164,8.5,8.6,2.9,1.411764705882353,1.3953488372093024,1.2127582164369164,8.5,8.6,2.9,1.411764705882353,1.3953488372093024,1.2127582164369164,"ASHRAE 90.1--1989 (as of Jan. 1, 1992) "]
[1996,null,1996,9.1999999999999993,10,1.3043478260869565,1.2,9,9.6999999999999993,1.3333333333333333,1.2371134020618557,8.9,9.1,1.348314606741573,1.3186813186813187,8.9,9.1,1.348314606741573,1.3186813186813187,8.3000000000000007,8.5,1.4457831325301203,1.411764705882353,8.3000000000000007,8.5,1.4457831325301203,1.411764705882353,8.3000000000000007,8.4,1.4457831325301203,1.4285714285714286,8.3000000000000007,8.4,1.4457831325301203,1.4285714285714286,8,8.1,1.5,1.4814814814814816,8,8.1,1.5,1.4814814814814816,"ASHRAE 90.1--1989 (as of Jan. 1, 1992) ",null,9.1999999999999993,10,6.8,1.3043478260869565,1.2,1.7647058823529411,9,9.6999999999999993,6.6,1.3333333333333333,1.2371134020618557,1.8181818181818183,8.9,9.1,3,1.348314606741573,1.3186813186813187,1.1723329425556859,8.9,9.1,3,1.348314606741573,1.3186813186813187,1.1723329425556859,8.3000000000000007,8.4,2.9,1.4457831325301203,1.4285714285714286,1.2127582164369164,8.3000000000000007,8.4,2.9,1.4457831325301203,1.4285714285714286,1.2127582164369164,8.3000000000000007,8.4,2.9,1.4457831325301203,1.4285714285714286,1.2127582164369164,8.3000000000000007,8.4,2.9,1.4457831325301203,1.4285714285714286,1.2127582164369164,8.5,8.6,2.9,1.411764705882353,1.3953488372093024,1.2127582164369164,8.5,8.6,2.9,1.411764705882353,1.3953488372093024,1.2127582164369164,"ASHRAE 90.1--1989 (as of Jan. 1, 1992) "]
[1997,null,1997,9.1999999999999993,10,1.3043478260869565,1.2,9,9.6999999999999993,1.3333333333333333,1.2371134020618557,8.9,9.1,1.348314606741573,1.3186813186813187,8.9,9.1,1.348314606741573,1.3186813186813187,8.3000000000000007,8.5,1.4457831325301203,1.411764705882353,8.3000000000000007,8.5,1.4457831325301203,1.411764705882353,8.3000000000000007,8.4,1.4457831325301203,1.4285714285714286,8.3000000000000007,8.4,1.4457831325301203,1.4285714285714286,8,8.1,1.5,1.4814814814814816,8,8.1,1.5,1.4814814814814816,"ASHRAE 90.1--1989 (as of Jan. 1, 1992) ",null,9.1999999999999993,10,6.8,1.3043478260869565,1.2,1.7647058823529411,9,9.6999999999999993,6.6,1.3333333333333333,1.2371134020618557,1.8181818181818183,8.9,9.1,3,1.348314606741573,1.3186813186813187,1.1723329425556859,8.9,9.1,3,1.348314606741573,1.3186813186813187,1.1723329425556859,8.3000000000000007,8.4,2.9,1.4457831325301203,1.4285714285714286,1.2127582164369164,8.3000000000000007,8.4,2.9,1.4457831325301203,1.4285714285714286,1.2127582164369164,8.3000000000000007,8.4,2.9,1.4457831325301203,1.4285714285714286,1.2127582164369164,8.3000000000000007,8.4,2.9,1.4457831325301203,1.4285714285714286,1.2127582164369164,8.5,8.6,2.9,1.411764705882353,1.3953488372093024,1.2127582164369164,8.5,8.6,2.9,1.411764705882353,1.3953488372093024,1.2127582164369164,"ASHRAE 90.1--1989 (as of Jan. 1, 1992) "]
[1998,null,1998,9.1999999999999993,10,1.3043478260869565,1.2,9,9.6999999999999993,1.3333333333333333,1.2371134020618557,8.9,9.1,1.348314606741573,1.3186813186813187,8.9,9.1,1.348314606741573,1.3186813186813187,8.3000000000000007,8.5,1.4457831325301203,1.411764705882353,8.3000000000000007,8.5,1.4457831325301203,1.411764705882353,8.3000000000000007,8.4,1.4457831325301203,1.4285714285714286,8.3000000000000007,8.4,1.4457831325301203,1.4285714285714286,8,8.1,1.5,1.4814814814814816,8,8.1,1.5,1.4814814814814816,"ASHRAE 90.1--1989 (as of Jan. 1, 1992) ",null,9.1999999999999993,10,6.8,1.3043478260869565,1.2,1.7647058823529411,9,9.6999999999999993,6.6,1.3333333333333333,1.2371134020618557,1.8181818181818183,8.9,9.1,3,1.348314606741573,1.3186813186813187,1.1723329425556859,8.9,9.1,3,1.348314606741573,1.3186813186813187,1.1723329425556859,8.3000000000000007,8.4,2.9,1.4457831325301203,1.4285714285714286,1.2127582164369164,8.3000000000000007,8.4,2.9,1.4457831325301203,1.4285714285714286,1.2127582164369164,8.3000000000000007,8.4,2.9,1.4457831325301203,1.4285714285714286,1.2127582164369164,8.3000000000000007,8.4,2.9,1.4457831325301203,1.4285714285714286,1.2127582164369164,8.5,8.6,2.9,1.411764705882353,1.3953488372093024,1.2127582164369164,8.5,8.6,2.9,1.411764705882353,1.3953488372093024,1.2127582164369164,"ASHRAE 90.1--1989 (as of Jan. 1, 1992) "]
[1999,null,1999,9.1999999999999993,10,1.3043478260869565,1.2,9,9.6999999999999993,1.3333333333333333,1.2371134020618557,8.9,9.1,1.348314606741573,1.3186813186813187,8.9,9.1,1.348314606741573,1.3186813186813187,8.3000000000000007,8.5,1.4457831325301203,1.411764705882353,8.3000000000000007,8.5,1.4457831325301203,1.411764705882353,8.3000000000000007,8.4,1.4457831325301203,1.4285714285714286,8.3000000000000007,8.4,1.4457831325301203,1.4285714285714286,8,8.1,1.5,1.4814814814814816,8,8.1,1.5,1.4814814814814816,"ASHRAE 90.1--1999",null,9.1999999999999993,10,6.8,1.3043478260869565,1.2,1.7647058823529411,9,9.6999999999999993,6.6,1.3333333333333333,1.2371134020618557,1.8181818181818183,8.9,9.1,3,1.348314606741573,1.3186813186813187,1.1723329425556859,8.9,9.1,3,1.348314606741573,1.3186813186813187,1.1723329425556859,8.3000000000000007,8.4,2.9,1.4457831325301203,1.4285714285714286,1.2127582164369164,8.3000000000000007,8.4,2.9,1.4457831325301203,1.4285714285714286,1.2127582164369164,8.3000000000000007,8.4,2.9,1.4457831325301203,1.4285714285714286,1.2127582164369164,8.3000000000000007,8.4,2.9,1.4457831325301203,1.4285714285714286,1.2127582164369164,8.5,8.6,2.9,1.411764705882353,1.3953488372093024,1.2127582164369164,8.5,8.6,2.9,1.411764705882353,1.3953488372093024,1.2127582164369164,"ASHRAE 90.1--1999"]
[2000,null,2000,9.1999999999999993,10,1.3043478260869565,1.2,9,9.6999999999999993,1.3333333333333333,1.2371134020618557,8.9,9.1,1.348314606741573,1.3186813186813187,8.9,9.1,1.348314606741573,1.3186813186813187,8.3000000000000007,8.5,1.4457831325301203,1.411764705882353,8.3000000000000007,8.5,1.4457831325301203,1.411764705882353,8.3000000000000007,8.4,1.4457831325301203,1.4285714285714286,8.3000000000000007,8.4,1.4457831325301203,1.4285714285714286,8,8.1,1.5,1.4814814814814816,8,8.1,1.5,1.4814814814814816,"ASHRAE 90.1--1999",null,9.1999999999999993,10,6.8,1.3043478260869565,1.2,1.7647058823529411,9,9.6999999999999993,6.6,1.3333333333333333,1.2371134020618557,1.8181818181818183,8.9,9.1,3,1.348314606741573,1.3186813186813187,1.1723329425556859,8.9,9.1,3,1.348314606741573,1.3186813186813187,1.1723329425556859,8.3000000000000007,8.4,2.9,1.4457831325301203,1.4285714285714286,1.2127582164369164,8.3000000000000007,8.4,2.9,1.4457831325301203,1.4285714285714286,1.2127582164369164,8.3000000000000007,8.4,2.9,1.4457831325301203,1.4285714285714286,1.2127582164369164,8.3000000000000007,8.4,2.9,1.4457831325301203,1.4285714285714286,1.2127582164369164,8.5,8.6,2.9,1.411764705882353,1.3953488372093024,1.2127582164369164,8.5,8.6,2.9,1.411764705882353,1.3953488372093024,1.2127582164369164,"ASHRAE 90.1--1999"]
[2001,null,2001,9.1999999999999993,10,1.3043478260869565,1.2,9,9.6999999999999993,1.3333333333333333,1.2371134020618557,8.9,9.1,1.348314606741573,1.3186813186813187,8.9,9.1,1.348314606741573,1.3186813186813187,8.3000000000000007,8.5,1.4457831325301203,1.411764705882353,8.3000000000000007,8.5,1.4457831325301203,1.411764705882353,8.3000000000000007,8.4,1.4457831325301203,1.4285714285714286,8.3000000000000007,8.4,1.4457831325301203,1.4285714285714286,8,8.1,1.5,1.4814814814814816,8,8.1,1.5,1.4814814814814816,"ASHRAE 90.1--1999",null,9.1999999999999993,10,6.8,1.3043478260869565,1.2,1.7647058823529411,9,9.6999999999999993,6.6,1.3333333333333333,1.2371134020618557,1.8181818181818183,8.9,9.1,3.2,1.348314606741573,1.3186813186813187,1.0990621336459554,8.9,9.1,3.2,1.348314606741573,1.3186813186813187,1.0990621336459554,8.3000000000000007,8.4,3.1,1.4457831325301203,1.4285714285714286,1.1345157508603412,8.3000000000000007,8.4,3.1,1.4457831325301203,1.4285714285714286,1.1345157508603412,8.3000000000000007,8.4,3.1,1.4457831325301203,1.4285714285714286,1.1345157508603412,8.3000000000000007,8.4,3.1,1.4457831325301203,1.4285714285714286,1.1345157508603412,8.5,8.6,3.1,1.411764705882353,1.3953488372093024,1.1345157508603412,8.5,8.6,3.1,1.411764705882353,1.3953488372093024,1.1345157508603412,"ASHRAE 90.1--1999"]
[2002,null,2002,9.1999999999999993,10,1.3043478260869565,1.2,9,9.6999999999999993,1.3333333333333333,1.2371134020618557,10.1,10.3,1.1881188118811881,1.1650485436893203,10.1,10.3,1.1881188118811881,1.1650485436893203,9.5,9.6999999999999993,1.263157894736842,1.2371134020618557,9.5,9.6999999999999993,1.263157894736842,1.2371134020618557,9.3000000000000007,9.4,1.2903225806451613,1.2765957446808509,9.3000000000000007,9.4,1.2903225806451613,1.2765957446808509,9,9.1,1.3333333333333333,1.3186813186813187,9,9.1,1.3333333333333333,1.3186813186813187,"ASHRAE 90.1--1999 (as of 10/29/2001)",null,9.1999999999999993,10,6.8,1.3043478260869565,1.2,1.7647058823529411,9,9.6999999999999993,6.6,1.3333333333333333,1.2371134020618557,1.8181818181818183,9.9,10.1,3.2,1.2121212121212122,1.1881188118811881,1.0990621336459554,9.9,10.1,3.2,1.2121212121212122,1.1881188118811881,1.0990621336459554,9.1,9.1999999999999993,3.1,1.3186813186813187,1.3043478260869565,1.1345157508603412,9.1,9.1999999999999993,3.1,1.3186813186813187,1.3043478260869565,1.1345157508603412,8.8000000000000007,8.9,3.1,1.3636363636363635,1.348314606741573,1.1345157508603412,8.8000000000000007,8.9,3.1,1.3636363636363635,1.348314606741573,1.1345157508603412,8.8000000000000007,8.9,3.1,1.3636363636363635,1.348314606741573,1.1345157508603412,8.8000000000000007,8.9,3.1,1.3636363636363635,1.348314606741573,1.1345157508603412,"ASHRAE 90.1--1999 (as of 10/29/2001)"]
[2003,null,2003,9.1999999999999993,10,1.3043478260869565,1.2,9,9.6999999999999993,1.3333333333333333,1.2371134020618557,10.1,10.3,1.1881188118811881,1.1650485436893203,10.1,10.3,1.1881188118811881,1.1650485436893203,9.5,9.6999999999999993,1.263157894736842,1.2371134020618557,9.5,9.6999999999999993,1.263157894736842,1.2371134020618557,9.3000000000000007,9.4,1.2903225806451613,1.2765957446808509,9.3000000000000007,9.4,1.2903225806451613,1.2765957446808509,9,9.1,1.3333333333333333,1.3186813186813187,9,9.1,1.3333333333333333,1.3186813186813187,"ASHRAE 90.1--1999 (as of 10/29/2001)",null,9.1999999999999993,10,6.8,1.3043478260869565,1.2,1.7647058823529411,9,9.6999999999999993,6.6,1.3333333333333333,1.2371134020618557,1.8181818181818183,9.9,10.1,3.2,1.2121212121212122,1.1881188118811881,1.0990621336459554,9.9,10.1,3.2,1.2121212121212122,1.1881188118811881,1.0990621336459554,9.1,9.1999999999999993,3.1,1.3186813186813187,1.3043478260869565,1.1345157508603412,9.1,9.1999999999999993,3.1,1.3186813186813187,1.3043478260869565,1.1345157508603412,8.8000000000000007,8.9,3.1,1.3636363636363635,1.348314606741573,1.1345157508603412,8.8000000000000007,8.9,3.1,1.3636363636363635,1.348314606741573,1.1345157508603412,8.8000000000000007,8.9,3.1,1.3636363636363635,1.348314606741573,1.1345157508603412,8.8000000000000007,8.9,3.1,1.3636363636363635,1.348314606741573,1.1345157508603412,"ASHRAE 90.1--1999 (as of 10/29/2001)"]
[2004,null,2004,9.1999999999999993,10,1.3043478260869565,1.2,9,9.6999999999999993,1.3333333333333333,1.2371134020618557,10.1,10.3,1.1881188118811881,1.1650485436893203,10.1,10.3,1.1881188118811881,1.1650485436893203,9.5,9.6999999999999993,1.263157894736842,1.2371134020618557,9.5,9.6999999999999993,1.263157894736842,1.2371134020618557,9.3000000000000007,9.4,1.2903225806451613,1.2765957446808509,9.3000000000000007,9.4,1.2903225806451613,1.2765957446808509,9,9.1,1.3333333333333333,1.3186813186813187,9,9.1,1.3333333333333333,1.3186813186813187,"ASHRAE 90.1--2004",null,9.1999999999999993,10,6.8,1.3043478260869565,1.2,1.7647058823529411,9,9.6999999999999993,6.6,1.3333333333333333,1.2371134020618557,1.8181818181818183,9.9,10.1,3.2,1.2121212121212122,1.1881188118811881,1.0990621336459554,9.9,10.1,3.2,1.2121212121212122,1.1881188118811881,1.0990621336459554,9.1,9.1999999999999993,3.1,1.3186813186813187,1.3043478260869565,1.1345157508603412,9.1,9.1999999999999993,3.1,1.3186813186813187,1.3043478260869565,1.1345157508603412,8.8000000000000007,8.9,3.1,1.3636363636363635,1.348314606741573,1.1345157508603412,8.8000000000000007,8.9,3.1,1.3636363636363635,1.348314606741573,1.1345157508603412,8.8000000000000007,8.9,3.1,1.3636363636363635,1.348314606741573,1.1345157508603412,8.8000000000000007,8.9,3.1,1.3636363636363635,1.348314606741573,1.1345157508603412,"ASHRAE 90.1--2004"]
[2005,null,2005,9.1999999999999993,10,1.3043478260869565,1.2,9,9.6999999999999993,1.3333333333333333,1.2371134020618557,10.1,10.3,1.1881188118811881,1.1650485436893203,10.1,10.3,1.1881188118811881,1.1650485436893203,9.5,9.6999999999999993,1.263157894736842,1.2371134020618557,9.5,9.6999999999999993,1.263157894736842,1.2371134020618557,9.3000000000000007,9.4,1.2903225806451613,1.2765957446808509,9.3000000000000007,9.4,1.2903225806451613,1.2765957446808509,9,9.1,1.3333333333333333,1.3186813186813187,9,9.1,1.3333333333333333,1.3186813186813187,"ASHRAE 90.1--2004",null,9.1999999999999993,10,6.8,1.3043478260869565,1.2,1.7647058823529411,9,9.6999999999999993,6.6,1.3333333333333333,1.2371134020618557,1.8181818181818183,9.9,10.1,3.2,1.2121212121212122,1.1881188118811881,1.0990621336459554,9.9,10.1,3.2,1.2121212121212122,1.1881188118811881,1.0990621336459554,9.1,9.1999999999999993,3.1,1.3186813186813187,1.3043478260869565,1.1345157508603412,9.1,9.1999999999999993,3.1,1.3186813186813187,1.3043478260869565,1.1345157508603412,8.8000000000000007,8.9,3.1,1.3636363636363635,1.348314606741573,1.1345157508603412,8.8000000000000007,8.9,3.1,1.3636363636363635,1.348314606741573,1.1345157508603412,8.8000000000000007,8.9,3.1,1.3636363636363635,1.348314606741573,1.1345157508603412,8.8000000000000007,8.9,3.1,1.3636363636363635,1.348314606741573,1.1345157508603412,"ASHRAE 90.1--2004"]
[2006,null,2006,11.2,13,1.0714285714285714,0.92307692307692313,11.2,13,1.0714285714285714,0.92307692307692313,10.1,10.3,1.1881188118811881,1.1650485436893203,10.1,10.3,1.1881188118811881,1.1650485436893203,9.5,9.6999999999999993,1.263157894736842,1.2371134020618557,9.5,9.6999999999999993,1.263157894736842,1.2371134020618557,9.3000000000000007,9.4,1.2903225806451613,1.2765957446808509,9.3000000000000007,9.4,1.2903225806451613,1.2765957446808509,9,9.1,1.3333333333333333,1.3186813186813187,9,9.1,1.3333333333333333,1.3186813186813187,"Federal Standard/ASHRAE 90.1-2004 (as of 1/23/2006)b",null,11.2,13,7.7,1.0714285714285714,0.92307692307692313,1.5584415584415585,11.2,13,7.7,1.0714285714285714,0.92307692307692313,1.5584415584415585,9.9,10.1,3.2,1.2121212121212122,1.1881188118811881,1.0990621336459554,9.9,10.1,3.2,1.2121212121212122,1.1881188118811881,1.0990621336459554,9.1,9.1999999999999993,3.1,1.3186813186813187,1.3043478260869565,1.1345157508603412,9.1,9.1999999999999993,3.1,1.3186813186813187,1.3043478260869565,1.1345157508603412,8.8000000000000007,8.9,3.1,1.3636363636363635,1.348314606741573,1.1345157508603412,8.8000000000000007,8.9,3.1,1.3636363636363635,1.348314606741573,1.1345157508603412,8.8000000000000007,8.9,3.1,1.3636363636363635,1.348314606741573,1.1345157508603412,8.8000000000000007,8.9,3.1,1.3636363636363635,1.348314606741573,1.1345157508603412,"Federal Standard/ASHRAE 90.1--2004 (as of 1/23/2006)b"]
[2007,null,2007,11.2,13,1.0714285714285714,0.92307692307692313,11.2,13,1.0714285714285714,0.92307692307692313,10.1,10.3,1.1881188118811881,1.1650485436893203,10.1,10.3,1.1881188118811881,1.1650485436893203,9.5,9.6999999999999993,1.263157894736842,1.2371134020618557,9.5,9.6999999999999993,1.263157894736842,1.2371134020618557,9.3000000000000007,9.4,1.2903225806451613,1.2765957446808509,9.3000000000000007,9.4,1.2903225806451613,1.2765957446808509,9,9.1,1.3333333333333333,1.3186813186813187,9,9.1,1.3333333333333333,1.3186813186813187,"Federal Standard/ASHRAE 90.1-2004 (as of 1/23/2006)b",null,11.2,13,7.7,1.0714285714285714,0.92307692307692313,1.5584415584415585,11.2,13,7.7,1.0714285714285714,0.92307692307692313,1.5584415584415585,9.9,10.1,3.2,1.2121212121212122,1.1881188118811881,1.0990621336459554,9.9,10.1,3.2,1.2121212121212122,1.1881188118811881,1.0990621336459554,9.1,9.1999999999999993,3.1,1.3186813186813187,1.3043478260869565,1.1345157508603412,9.1,9.1999999999999993,3.1,1.3186813186813187,1.3043478260869565,1.1345157508603412,8.8000000000000007,8.9,3.1,1.3636363636363635,1.348314606741573,1.1345157508603412,8.8000000000000007,8.9,3.1,1.3636363636363635,1.348314606741573,1.1345157508603412,8.8000000000000007,8.9,3.1,1.3636363636363635,1.348314606741573,1.1345157508603412,8.8000000000000007,8.9,3.1,1.3636363636363635,1.348314606741573,1.1345157508603412,"Federal Standard/ASHRAE 90.1-2007 (as of 1/23/2006)b"]
[2008,null,2008,11.2,13,1.0714285714285714,0.92307692307692313,11.2,13,1.0714285714285714,0.92307692307692313,10.1,10.3,1.1881188118811881,1.1650485436893203,10.1,10.3,1.1881188118811881,1.1650485436893203,9.5,9.6999999999999993,1.263157894736842,1.2371134020618557,9.5,9.6999999999999993,1.263157894736842,1.2371134020618557,9.3000000000000007,9.4,1.2903225806451613,1.2765957446808509,9.3000000000000007,9.4,1.2903225806451613,1.2765957446808509,9,9.1,1.3333333333333333,1.3186813186813187,9,9.1,1.3333333333333333,1.3186813186813187,"Federal Standard/ASHRAE 90.1-2004 (as of 1/23/2006)b",null,11.2,13,7.7,1.0714285714285714,0.92307692307692313,1.5584415584415585,11.2,13,7.7,1.0714285714285714,0.92307692307692313,1.5584415584415585,9.9,10.1,3.2,1.2121212121212122,1.1881188118811881,1.0990621336459554,9.9,10.1,3.2,1.2121212121212122,1.1881188118811881,1.0990621336459554,9.1,9.1999999999999993,3.1,1.3186813186813187,1.3043478260869565,1.1345157508603412,9.1,9.1999999999999993,3.1,1.3186813186813187,1.3043478260869565,1.1345157508603412,8.8000000000000007,8.9,3.1,1.3636363636363635,1.348314606741573,1.1345157508603412,8.8000000000000007,8.9,3.1,1.3636363636363635,1.348314606741573,1.1345157508603412,8.8000000000000007,8.9,3.1,1.3636363636363635,1.348314606741573,1.1345157508603412,8.8000000000000007,8.9,3.1,1.3636363636363635,1.348314606741573,1.1345157508603412,"Federal Standard/ASHRAE 90.1-2007 (as of 1/23/2006)b"]
[2009,null,2009,11.2,13,1.0714285714285714,0.92307692307692313,11.2,13,1.0714285714285714,0.92307692307692313,10.1,10.3,1.1881188118811881,1.1650485436893203,10.1,10.3,1.1881188118811881,1.1650485436893203,9.5,9.6999999999999993,1.263157894736842,1.2371134020618557,9.5,9.6999999999999993,1.263157894736842,1.2371134020618557,9.3000000000000007,9.4,1.2903225806451613,1.2765957446808509,9.3000000000000007,9.4,1.2903225806451613,1.2765957446808509,9,9.1,1.3333333333333333,1.3186813186813187,9,9.1,1.3333333333333333,1.3186813186813187,"Federal Standard/ASHRAE 90.1-2004 (as of 1/23/2006)b",null,11.2,13,7.7,1.0714285714285714,0.92307692307692313,1.5584415584415585,11.2,13,7.7,1.0714285714285714,0.92307692307692313,1.5584415584415585,9.9,10.1,3.2,1.2121212121212122,1.1881188118811881,1.0990621336459554,9.9,10.1,3.2,1.2121212121212122,1.1881188118811881,1.0990621336459554,9.1,9.1999999999999993,3.1,1.3186813186813187,1.3043478260869565,1.1345157508603412,9.1,9.1999999999999993,3.1,1.3186813186813187,1.3043478260869565,1.1345157508603412,8.8000000000000007,8.9,3.1,1.3636363636363635,1.348314606741573,1.1345157508603412,8.8000000000000007,8.9,3.1,1.3636363636363635,1.348314606741573,1.1345157508603412,8.8000000000000007,8.9,3.1,1.3636363636363635,1.348314606741573,1.1345157508603412,8.8000000000000007,8.9,3.1,1.3636363636363635,1.348314606741573,1.1345157508603412,"Federal Standard/ASHRAE 90.1-2007 (as of 1/23/2006)b"]
[2010,null,2010,11.2,13,1.0714285714285714,0.92307692307692313,11.2,13,1.0714285714285714,0.92307692307692313,11,11.2,1.0909090909090908,1.0714285714285714,11,11.2,1.0909090909090908,1.0714285714285714,10.8,11,1.1111111111111109,1.0909090909090908,10.8,11,1.1111111111111109,1.0909090909090908,9.8000000000000007,9.9,1.2244897959183672,1.2121212121212122,9.8000000000000007,9.9,1.2244897959183672,1.2121212121212122,9.5,9.6,1.263157894736842,1.25,9.5,9.6,1.263157894736842,1.25,"Federal Standard/ASHRAE 90.1-2007 (as of 1/1/2010)b",null,11.2,13,7.7,1.0714285714285714,0.92307692307692313,1.5584415584415585,11.2,13,7.7,1.0714285714285714,0.92307692307692313,1.5584415584415585,10.8,11,3.3,1.1111111111111109,1.0909090909090908,1.0657572205051691,10.8,11,3.3,1.1111111111111109,1.0909090909090908,1.0657572205051691,10.4,10.5,3.2,1.1538461538461537,1.1428571428571428,1.0990621336459554,10.4,10.5,3.2,1.1538461538461537,1.1428571428571428,1.0990621336459554,9.3000000000000007,9.4,3.2,1.2903225806451613,1.2765957446808509,1.0990621336459554,9.3000000000000007,9.4,3.2,1.2903225806451613,1.2765957446808509,1.0990621336459554,9.3000000000000007,9.4,3.2,1.2903225806451613,1.2765957446808509,1.0990621336459554,9.3000000000000007,9.4,3.2,1.2903225806451613,1.2765957446808509,1.0990621336459554,"Federal Standard/ASHRAE 90.1-2007 (as of 1/1/2010)b"]
[2011,null,2011,11.2,13,1.0714285714285714,0.92307692307692313,11.2,13,1.0714285714285714,0.92307692307692313,11,11.2,1.0909090909090908,1.0714285714285714,11,11.2,1.0909090909090908,1.0714285714285714,10.8,11,1.1111111111111109,1.0909090909090908,10.8,11,1.1111111111111109,1.0909090909090908,9.8000000000000007,9.9,1.2244897959183672,1.2121212121212122,9.8000000000000007,9.9,1.2244897959183672,1.2121212121212122,9.5,9.6,1.263157894736842,1.25,9.5,9.6,1.263157894736842,1.25,"Federal Standard/ASHRAE 90.1-2007 (as of 1/1/2010)b",null,11.2,13,7.7,1.0714285714285714,0.92307692307692313,1.5584415584415585,11.2,13,7.7,1.0714285714285714,0.92307692307692313,1.5584415584415585,10.8,11,3.3,1.1111111111111109,1.0909090909090908,1.0657572205051691,10.8,11,3.3,1.1111111111111109,1.0909090909090908,1.0657572205051691,10.4,10.5,3.2,1.1538461538461537,1.1428571428571428,1.0990621336459554,10.4,10.5,3.2,1.1538461538461537,1.1428571428571428,1.0990621336459554,9.3000000000000007,9.4,3.2,1.2903225806451613,1.2765957446808509,1.0990621336459554,9.3000000000000007,9.4,3.2,1.2903225806451613,1.2765957446808509,1.0990621336459554,9.3000000000000007,9.4,3.2,1.2903225806451613,1.2765957446808509,1.0990621336459554,9.3000000000000007,9.4,3.2,1.2903225806451613,1.2765957446808509,1.0990621336459554,"Federal Standard/ASHRAE 90.1-2007 (as of 1/1/2010)b"]
[2012,null,2012,11.2,13,1.0714285714285714,0.92307692307692313,11.2,13,1.0714285714285714,0.92307692307692313,11,11.2,1.0909090909090908,1.0714285714285714,11,11.2,1.0909090909090908,1.0714285714285714,10.8,11,1.1111111111111109,1.0909090909090908,10.8,11,1.1111111111111109,1.0909090909090908,9.8000000000000007,9.9,1.2244897959183672,1.2121212121212122,9.8000000000000007,9.9,1.2244897959183672,1.2121212121212122,9.5,9.6,1.263157894736842,1.25,9.5,9.6,1.263157894736842,1.25,"Federal Standard/ASHRAE 90.1-2007 (as of 1/1/2010)b",null,11.2,13,7.7,1.0714285714285714,0.92307692307692313,1.5584415584415585,11.2,13,7.7,1.0714285714285714,0.92307692307692313,1.5584415584415585,10.8,11,3.3,1.1111111111111109,1.0909090909090908,1.0657572205051691,10.8,11,3.3,1.1111111111111109,1.0909090909090908,1.0657572205051691,10.4,10.5,3.2,1.1538461538461537,1.1428571428571428,1.0990621336459554,10.4,10.5,3.2,1.1538461538461537,1.1428571428571428,1.0990621336459554,9.3000000000000007,9.4,3.2,1.2903225806451613,1.2765957446808509,1.0990621336459554,9.3000000000000007,9.4,3.2,1.2903225806451613,1.2765957446808509,1.0990621336459554,9.3000000000000007,9.4,3.2,1.2903225806451613,1.2765957446808509,1.0990621336459554,9.3000000000000007,9.4,3.2,1.2903225806451613,1.2765957446808509,1.0990621336459554,"Federal Standard/ASHRAE 90.1-2007 (as of 1/1/2010)b"]
[2013,null,2013,11.2,13,{"$f":"12/D29","v":1.0714285714285714},{"$f":"12/E29","v":0.92307692307692313},11.2,13,{"$f":"12/H29","v":1.0714285714285714},{"$f":"12/I29","v":0.92307692307692313},11,11.2,{"$f":"12/L29","v":1.0909090909090908},{"$f":"12/M29","v":1.0714285714285714},11,11.2,{"$f":"12/P29","v":1.0909090909090908},{"$f":"12/Q29","v":1.0714285714285714},10.8,11,{"$f":"12/T29","v":1.1111111111111109},{"$f":"12/U29","v":1.0909090909090908},10.8,11,{"$f":"12/X29","v":1.1111111111111109},{"$f":"12/Y29","v":1.0909090909090908},9.8000000000000007,9.9,{"$f":"12/AB29","v":1.2244897959183672},{"$f":"12/AC29","v":1.2121212121212122},9.8000000000000007,9.9,{"$f":"12/AF29","v":1.2244897959183672},{"$f":"12/AG29","v":1.2121212121212122},9.5,9.6,{"$f":"12/AJ29","v":1.263157894736842},{"$f":"12/AK29","v":1.25},9.5,9.6,{"$f":"12/AN29","v":1.263157894736842},{"$f":"12/AO29","v":1.25},null,null,11.2,13,7.7,{"$f":"12/AT29","v":1.0714285714285714},{"$f":"12/AU29","v":0.92307692307692313},{"$f":"12/AV29","v":1.5584415584415585},11.2,13,7.7,{"$f":"12/AZ29","v":1.0714285714285714},{"$f":"12/BA29","v":0.92307692307692313},{"$f":"12/BB29","v":1.5584415584415585},10.8,11,3.3,{"$f":"12/BF29","v":1.1111111111111109},{"$f":"12/BG29","v":1.0909090909090908},{"$f":"12/3.412/BH29","v":1.0657572205051691},10.8,11,3.3,{"$f":"12/BL29","v":1.1111111111111109},{"$f":"12/BM29","v":1.0909090909090908},{"$f":"12/3.412/BN29","v":1.0657572205051691},10.4,10.5,3.2,{"$f":"12/BR29","v":1.1538461538461537},{"$f":"12/BS29","v":1.1428571428571428},{"$f":"12/3.412/BT29","v":1.0990621336459554},10.4,10.5,3.2,{"$f":"12/BX29","v":1.1538461538461537},{"$f":"12/BY29","v":1.1428571428571428},{"$f":"12/3.412/BZ29","v":1.0990621336459554},9.3000000000000007,9.4,3.2,{"$f":"12/CD29","v":1.2903225806451613},{"$f":"12/CE29","v":1.2765957446808509},{"$f":"12/3.412/CF29","v":1.0990621336459554},9.3000000000000007,9.4,3.2,{"$f":"12/CJ29","v":1.2903225806451613},{"$f":"12/CK29","v":1.2765957446808509},{"$f":"12/3.412/CL29","v":1.0990621336459554},9.3000000000000007,9.4,3.2,{"$f":"12/CP29","v":1.2903225806451613},{"$f":"12/CQ29","v":1.2765957446808509},{"$f":"12/3.412/CR29","v":1.0990621336459554},9.3000000000000007,9.4,3.2,{"$f":"12/CV29","v":1.2903225806451613},{"$f":"12/CW29","v":1.2765957446808509},{"$f":"12/3.412/CX29","v":1.0990621336459554}]
[2014,null,2014,11.2,13,1.0714285714285714,0.92307692307692313,11.2,13,1.0714285714285714,0.92307692307692313,11,11.2,1.0909090909090908,1.0714285714285714,11,11.2,1.0909090909090908,1.0714285714285714,10.8,11,1.1111111111111109,1.0909090909090908,10.8,11,1.1111111111111109,1.0909090909090908,9.8000000000000007,9.9,1.2244897959183672,1.2121212121212122,9.8000000000000007,9.9,1.2244897959183672,1.2121212121212122,9.5,9.6,1.263157894736842,1.25,9.5,9.6,1.263157894736842,1.25,null,null,11.2,13,7.7,1.0714285714285714,0.92307692307692313,1.5584415584415585,11.2,13,7.7,1.0714285714285714,0.92307692307692313,1.5584415584415585,10.8,11,3.3,1.1111111111111109,1.0909090909090908,1.0657572205051691,10.8,11,3.3,1.1111111111111109,1.0909090909090908,1.0657572205051691,10.4,10.5,3.2,1.1538461538461537,1.1428571428571428,1.0990621336459554,10.4,10.5,3.2,1.1538461538461537,1.1428571428571428,1.0990621336459554,9.3000000000000007,9.4,3.2,1.2903225806451613,1.2765957446808509,1.0990621336459554,9.3000000000000007,9.4,3.2,1.2903225806451613,1.2765957446808509,1.0990621336459554,9.3000000000000007,9.4,3.2,1.2903225806451613,1.2765957446808509,1.0990621336459554,9.3000000000000007,9.4,3.2,1.2903225806451613,1.2765957446808509,1.0990621336459554]
[2015,null,2015,11.2,13,1.0714285714285714,0.92307692307692313,11.2,13,1.0714285714285714,0.92307692307692313,11,11.2,1.0909090909090908,1.0714285714285714,11,11.2,1.0909090909090908,1.0714285714285714,10.8,11,1.1111111111111109,1.0909090909090908,10.8,11,1.1111111111111109,1.0909090909090908,9.8000000000000007,9.9,1.2244897959183672,1.2121212121212122,9.8000000000000007,9.9,1.2244897959183672,1.2121212121212122,9.5,9.6,1.263157894736842,1.25,9.5,9.6,1.263157894736842,1.25,null,null,11.8,13,7.7,1.0169491525423728,0.92307692307692313,1.5584415584415585,11.2,13,7.7,1.0714285714285714,0.92307692307692313,1.5584415584415585,10.8,11,3.3,1.1111111111111109,1.0909090909090908,1.0657572205051691,10.8,11,3.3,1.1111111111111109,1.0909090909090908,1.0657572205051691,10.4,10.5,3.2,1.1538461538461537,1.1428571428571428,1.0990621336459554,10.4,10.5,3.2,1.1538461538461537,1.1428571428571428,1.0990621336459554,9.3000000000000007,9.4,3.2,1.2903225806451613,1.2765957446808509,1.0990621336459554,9.3000000000000007,9.4,3.2,1.2903225806451613,1.2765957446808509,1.0990621336459554,9.3000000000000007,9.4,3.2,1.2903225806451613,1.2765957446808509,1.0990621336459554,9.3000000000000007,9.4,3.2,1.2903225806451613,1.2765957446808509,1.0990621336459554]
[2016,null,2016,11.2,13,1.0714285714285714,0.92307692307692313,11.8,14,1.0169491525423728,0.8571428571428571,11,12.6,1.0909090909090908,0.95238095238095244,11,12.6,1.0909090909090908,0.95238095238095244,10.8,12.2,1.1111111111111109,0.98360655737704927,10.8,12.2,1.1111111111111109,0.98360655737704927,9.8000000000000007,11.4,1.2244897959183672,1.0526315789473684,9.8000000000000007,11.4,1.2244897959183672,1.0526315789473684,9.5,11,1.263157894736842,1.0909090909090908,9.5,11,1.263157894736842,1.0909090909090908,null,null,11.8,14,7.7,1.0169491525423728,0.8571428571428571,1.5584415584415585,11.8,13,7.7,1.0169491525423728,0.92307692307692313,1.5584415584415585,11,12,3.3,1.0909090909090908,1,1.0657572205051691,11,12,3.3,1.0909090909090908,1,1.0657572205051691,10.6,11.6,3.2,1.1320754716981132,1.0344827586206897,1.0990621336459554,10.6,11.6,3.2,1.1320754716981132,1.0344827586206897,1.0990621336459554,9.5,10.6,3.2,1.263157894736842,1.1320754716981132,1.0990621336459554,9.5,10.6,3.2,1.263157894736842,1.1320754716981132,1.0990621336459554,9.5,10.6,3.2,1.263157894736842,1.1320754716981132,1.0990621336459554,9.5,10.6,3.2,1.263157894736842,1.1320754716981132,1.0990621336459554]
[2017,null,2017,11.2,13,1.0714285714285714,0.92307692307692313,11.8,14,1.0169491525423728,0.8571428571428571,11,12.6,1.0909090909090908,0.95238095238095244,11,12.6,1.0909090909090908,0.95238095238095244,10.8,12.2,1.1111111111111109,0.98360655737704927,10.8,12.2,1.1111111111111109,0.98360655737704927,9.8000000000000007,11.4,1.2244897959183672,1.0526315789473684,9.8000000000000007,11.4,1.2244897959183672,1.0526315789473684,9.5,11,1.263157894736842,1.0909090909090908,9.5,11,1.263157894736842,1.0909090909090908,null,null,11.8,14,7.7,1.0169491525423728,0.8571428571428571,1.5584415584415585,11.8,13,7.7,1.0169491525423728,0.92307692307692313,1.5584415584415585,11,12,3.3,1.0909090909090908,1,1.0657572205051691,11,12,3.3,1.0909090909090908,1,1.0657572205051691,10.6,11.6,3.2,1.1320754716981132,1.0344827586206897,1.0990621336459554,10.6,11.6,3.2,1.1320754716981132,1.0344827586206897,1.0990621336459554,9.5,10.6,3.2,1.263157894736842,1.1320754716981132,1.0990621336459554,9.5,10.6,3.2,1.263157894736842,1.1320754716981132,1.0990621336459554,9.5,10.6,3.2,1.263157894736842,1.1320754716981132,1.0990621336459554,9.5,10.6,3.2,1.263157894736842,1.1320754716981132,1.0990621336459554]
[2018,null,2018,11.2,13,1.0714285714285714,0.92307692307692313,11.8,14,1.0169491525423728,0.8571428571428571,11,12.6,1.0909090909090908,0.95238095238095244,11,12.6,1.0909090909090908,0.95238095238095244,10.8,12.2,1.1111111111111109,0.98360655737704927,10.8,12.2,1.1111111111111109,0.98360655737704927,9.8000000000000007,11.4,1.2244897959183672,1.0526315789473684,9.8000000000000007,11.4,1.2244897959183672,1.0526315789473684,9.5,11,1.263157894736842,1.0909090909090908,9.5,11,1.263157894736842,1.0909090909090908,null,null,11.8,14,8.1999999999999993,1.0169491525423728,0.8571428571428571,1.4634146341463417,11.8,14,8,1.0169491525423728,0.8571428571428571,1.5,11,12,3.3,1.0909090909090908,1,1.0657572205051691,11,12,3.3,1.0909090909090908,1,1.0657572205051691,10.6,11.6,3.2,1.1320754716981132,1.0344827586206897,1.0990621336459554,10.6,11.6,3.2,1.1320754716981132,1.0344827586206897,1.0990621336459554,9.5,10.6,3.2,1.263157894736842,1.1320754716981132,1.0990621336459554,9.5,10.6,3.2,1.263157894736842,1.1320754716981132,1.0990621336459554,9.5,10.6,3.2,1.263157894736842,1.1320754716981132,1.0990621336459554,9.5,10.6,3.2,1.263157894736842,1.1320754716981132,1.0990621336459554]
["ARTRM8",null,"ARTRM8",11.2,14,{"$f":"12/D35","v":1.0714285714285714},0.8571428571428571,11.8,14,{"$f":"12/H35","v":1.0169491525423728},{"$f":"12/I35","v":0.8571428571428571},11.2,12.8,{"$f":"12/L35","v":1.0714285714285714},{"$f":"12/M35","v":0.9375},11,12.8,1.0909090909090908,0.9375,11,12.4,1.0909090909090908,0.96774193548387089,10.8,12.2,1.1111111111111109,0.98360655737704927,10,11.6,1.2,1.0344827586206897,9.8000000000000007,11.4,1.2244897959183672,1.0526315789473684,9.6999999999999993,11.2,1.2371134020618557,1.0714285714285714,9.5,11,1.263157894736842,1.0909090909090908,null,null,11.8,14,8.1999999999999993,1.0169491525423728,0.8571428571428571,1.4634146341463417,11.8,14,8,1.0169491525423728,0.8571428571428571,1.5,11,12,3.3,1.0909090909090908,1,1.0657572205051691,10.8,11.8,3.3,1.1111111111111109,1.0169491525423728,1.0657572205051691,10.6,11.6,3.2,1.1320754716981132,1.0344827586206897,1.0990621336459554,10.4,11.4,3.2,1.1538461538461537,1.0526315789473684,1.0990621336459554,9.5,10.6,3.2,1.263157894736842,1.1320754716981132,1.0990621336459554,9.3000000000000007,9.4,3.2,1.2903225806451613,1.2765957446808509,1.0990621336459554,9.5,10.6,3.2,{"$f":"12/CP35","v":1.263157894736842},{"$f":"12/CQ35","v":1.1320754716981132},{"$f":"12/3.412/CR35","v":1.0990621336459554},9.3000000000000007,9.4,3.2,{"$f":"12/CV35","v":1.2903225806451613},{"$f":"12/CW35","v":1.2765957446808509},{"$f":"12/3.412/CX35","v":1.0990621336459554}]
["CPS",null,"CPS",11.2,13,1.0714285714285714,0.92307692307692313,11.8,14,1.0169491525423728,0.8571428571428571,11.2,12.8,1.0714285714285714,0.9375,11,12.6,1.0909090909090908,0.95238095238095244,11,12.4,1.0909090909090908,0.96774193548387089,10.8,12.2,1.1111111111111109,0.98360655737704927,10,11.6,1.2,1.0344827586206897,9.8000000000000007,11.4,1.2244897959183672,1.0526315789473684,9.6999999999999993,11.2,1.2371134020618557,1.0714285714285714,9.5,11,1.263157894736842,1.0909090909090908,"CEE Tier 2f",null,11.8,14,8.1999999999999993,1.0169491525423728,0.8571428571428571,1.4634146341463417,11.8,14,8,1.0169491525423728,0.8571428571428571,1.5,11,12,3.3,1.0909090909090908,1,1.0657572205051691,10.8,11.8,3.3,1.1111111111111109,1.0169491525423728,1.0657572205051691,10.6,11.6,3.2,1.1320754716981132,1.0344827586206897,1.0990621336459554,10.4,11.4,3.2,1.1538461538461537,1.0526315789473684,1.0990621336459554,9.5,10.6,3.2,1.263157894736842,1.1320754716981132,1.0990621336459554,9.3000000000000007,9.4,3.2,1.2903225806451613,1.2765957446808509,1.0990621336459554,9.5,10.6,3.2,1.263157894736842,1.1320754716981132,1.0990621336459554,9.3000000000000007,9.4,3.2,1.2903225806451613,1.2765957446808509,1.0990621336459554,"Federal Standard/ASHRAE 90.1-2007 (as of 1/1/2010)"]

{"sheet":"VRF","index":8,"n_rows":37,"n_cols":61,"rows_kept":37,"cut":false,"hidden":true,"merged":[]}
[null,"VRFAirConditioner",null,null,null,"VRFAirConditioner",null,null,null,"VRFAirConditioner",null,null,null,"VRFAirConditioner",null,null,null,null,"VRFHeatPump",null,null,null,null,null,"VRFHeatPump",null,null,null,null,null,"VRFHeatPump",null,null,null,null,null,"VRFHeatPump",null,null,null,null,null,"VRFHeatPump",null,null,null,null,null,"VRFHeatPump",null,null,null,null,null,"VRFHeatPump"]
[null,null,null,null,null,null,null,null,null,null,null,null,null,null,null,null,null,null,null,"Both with and without heat recovery",null,null,null,null,"Without Heat Recovery",null,null,null,null,null,"With Heat Recovery",null,null,null,null,null,"Without Heat Recovery",null,null,null,null,null,"With Heat Recovery",null,null,null,null,null,"Without Heat Recovery",null,null,null,null,null,"With Heat Recovery"]
[]
[null,"Lessthan65kbtuh",null,null,null,"65to135kbtuh",null,null,null,"135to240kbtuh",null,null,null,"Greaterthan240kbtuh",null,null,null,null,"Lessthan65kbtuh",null,null,null,null,null,"65to135kbtuh",null,null,null,null,null,"65to135kbtuh",null,null,null,null,null,"135to240kbtuh",null,null,null,null,null,"135to240kbtuh",null,null,null,null,null,"Greaterthan240kbtuh",null,null,null,null,null,"Greaterthan240kbtuh"]
[null,{"$f":"B1&B2&B3&B4","v":"VRFAirConditionerLessthan65kbtuh"},null,null,null,{"$f":"F1&F2&F3&F4","v":"VRFAirConditioner65to135kbtuh"},null,null,null,{"$f":"J1&J2&J3&J4","v":"VRFAirConditioner135to240kbtuh"},null,null,null,{"$f":"N1&N2&N3&N4","v":"VRFAirConditionerGreaterthan240kbtuh"},null,null,null,null,{"$f":"S1&S2&S3&S4","v":"VRFHeatPumpLessthan65kbtuh"},null,null,null,null,null,{"$f":"Y1&Y2&Y3&Y4","v":"VRFHeatPumpWithout Heat Recovery65to135kbtuh"},null,null,null,null,null,{"$f":"AE1&AE2&AE3&AE4","v":"VRFHeatPumpWith Heat Recovery65to135kbtuh"},null,null,null,null,null,{"$f":"AK1&AK2&AK3&AK4","v":"VRFHeatPumpWithout Heat Recovery135to240kbtuh"},null,null,null,null,null,{"$f":"AQ1&AQ2&AQ3&AQ4","v":"VRFHeatPumpWith Heat Recovery135to240kbtuh"},null,null,null,null,null,{"$f":"AW1&AW2&AW3&AW4","v":"VRFHeatPumpWithout Heat RecoveryGreaterthan240kbtuh"},null,null,null,null,null,{"$f":"BC1&BC2&BC3&BC4","v":"VRFHeatPumpWith Heat RecoveryGreaterthan240kbtuh"}]
["Manuf. Year","EER","SEERadj","Full Load","Part Load","EER","IEERadj","Full Load","Part Load","EER","IEERadj","Full Load","Part Load","EER","IEERadj","Full Load","Part Load",null,"EER","SEERadj","HSPF","Full Load","Part Load","Heating","EER","IEERadj","COP","Full Load","Part Load","Heating","EER","IEERadj","COP","Full Load","Part Load","Heating","EER","IEERadj","COP","Full Load","Part Load","Heating","EER","IEERadj","COP","Full Load","Part Load","Heating","EER","IEERadj","COP","Full Load","Part Load","Heating","EER","IEERadj","COP","Full Load","Part Load","Heating","Applicable Standard"]
[1990,null,null,{"$f":"D$37","v":1.0169491525423728},0.8571428571428571,null,null,{"$f":"H$37","v":1.0714285714285714},0.91603053435114501,null,null,{"$f":"L$37","v":1.0909090909090908},0.93023255813953487,null,null,{"$f":"P$37","v":1.2},1.0344827586206897,null,null,null,null,{"$f":"V8","v":1.0169491525423728},{"$f":"W8","v":0.8571428571428571},{"$f":"X8","v":1.4634146341463417},null,null,null,{"$f":"AB8","v":1.0909090909090908},{"$f":"AC8","v":0.93023255813953487},{"$f":"AD8","v":1.0657572205051691},null,null,null,{"$f":"AH8","v":1.1111111111111109},{"$f":"AI8","v":0.94488188976377963},{"$f":"AJ8","v":1.0657572205051691},null,null,null,{"$f":"AN8","v":1.1320754716981132},{"$f":"AO8","v":0.97560975609756095},{"$f":"AP8","v":1.0990621336459554},null,null,null,{"$f":"AT8","v":1.1538461538461537},{"$f":"AU8","v":0.99173553719008267},{"$f":"AV8","v":1.0990621336459554},null,null,null,{"$f":"AZ8","v":1.263157894736842},{"$f":"BA8","v":1.0909090909090908},{"$f":"BB8","v":1.0990621336459554},null,null,null,{"$f":"BF8","v":1.2903225806451613},{"$f":"BG8","v":1.1111111111111109},{"$f":"BH8","v":1.0990621336459554}]
[1991,null,null,1.0169491525423728,0.8571428571428571,null,null,1.0714285714285714,0.91603053435114501,null,null,1.0909090909090908,0.93023255813953487,null,null,1.2,1.0344827586206897,null,null,null,null,1.0169491525423728,0.8571428571428571,1.4634146341463417,null,null,null,1.0909090909090908,0.93023255813953487,1.0657572205051691,null,null,null,1.1111111111111109,0.94488188976377963,1.0657572205051691,null,null,null,1.1320754716981132,0.97560975609756095,1.0990621336459554,null,null,null,1.1538461538461537,0.99173553719008267,1.0990621336459554,null,null,null,1.263157894736842,1.0909090909090908,1.0990621336459554,null,null,null,1.2903225806451613,1.1111111111111109,1.0990621336459554]
[1992,null,null,1.0169491525423728,0.8571428571428571,null,null,1.0714285714285714,0.91603053435114501,null,null,1.0909090909090908,0.93023255813953487,null,null,1.2,1.0344827586206897,null,null,null,null,1.0169491525423728,0.8571428571428571,1.4634146341463417,null,null,null,1.0909090909090908,0.93023255813953487,1.0657572205051691,null,null,null,1.1111111111111109,0.94488188976377963,1.0657572205051691,null,null,null,1.1320754716981132,0.97560975609756095,1.0990621336459554,null,null,null,1.1538461538461537,0.99173553719008267,1.0990621336459554,null,null,null,1.263157894736842,1.0909090909090908,1.0990621336459554,null,null,null,1.2903225806451613,1.1111111111111109,1.0990621336459554]
[1993,null,null,1.0169491525423728,0.8571428571428571,null,null,1.0714285714285714,0.91603053435114501,null,null,1.0909090909090908,0.93023255813953487,null,null,1.2,1.0344827586206897,null,null,null,null,1.0169491525423728,0.8571428571428571,1.4634146341463417,null,null,null,1.0909090909090908,0.93023255813953487,1.0657572205051691,null,null,null,1.1111111111111109,0.94488188976377963,1.0657572205051691,null,null,null,1.1320754716981132,0.97560975609756095,1.0990621336459554,null,null,null,1.1538461538461537,0.99173553719008267,1.0990621336459554,null,null,null,1.263157894736842,1.0909090909090908,1.0990621336459554,null,null,null,1.2903225806451613,1.1111111111111109,1.0990621336459554]
[1994,null,null,1.0169491525423728,0.8571428571428571,null,null,1.0714285714285714,0.91603053435114501,null,null,1.0909090909090908,0.93023255813953487,null,null,1.2,1.0344827586206897,null,null,null,null,1.0169491525423728,0.8571428571428571,1.4634146341463417,null,null,null,1.0909090909090908,0.93023255813953487,1.0657572205051691,null,null,null,1.1111111111111109,0.94488188976377963,1.0657572205051691,null,null,null,1.1320754716981132,0.97560975609756095,1.0990621336459554,null,null,null,1.1538461538461537,0.99173553719008267,1.0990621336459554,null,null,null,1.263157894736842,1.0909090909090908,1.0990621336459554,null,null,null,1.2903225806451613,1.1111111111111109,1.0990621336459554]
[1995,null,null,1.0169491525423728,0.8571428571428571,null,null,1.0714285714285714,0.91603053435114501,null,null,1.0909090909090908,0.93023255813953487,null,null,1.2,1.0344827586206897,null,null,null,null,1.0169491525423728,0.8571428571428571,1.4634146341463417,null,null,null,1.0909090909090908,0.93023255813953487,1.0657572205051691,null,null,null,1.1111111111111109,0.94488188976377963,1.0657572205051691,null,null,null,1.1320754716981132,0.97560975609756095,1.0990621336459554,null,null,null,1.1538461538461537,0.99173553719008267,1.0990621336459554,null,null,null,1.263157894736842,1.0909090909090908,1.0990621336459554,null,null,null,1.2903225806451613,1.1111111111111109,1.0990621336459554]
[1996,null,null,1.0169491525423728,0.8571428571428571,null,null,1.0714285714285714,0.91603053435114501,null,null,1.0909090909090908,0.93023255813953487,null,null,1.2,1.0344827586206897,null,null,null,null,1.0169491525423728,0.8571428571428571,1.4634146341463417,null,null,null,1.0909090909090908,0.93023255813953487,1.0657572205051691,null,null,null,1.1111111111111109,0.94488188976377963,1.0657572205051691,null,null,null,1.1320754716981132,0.97560975609756095,1.0990621336459554,null,null,null,1.1538461538461537,0.99173553719008267,1.0990621336459554,null,null,null,1.263157894736842,1.0909090909090908,1.0990621336459554,null,null,null,1.2903225806451613,1.1111111111111109,1.0990621336459554]
[1997,null,null,1.0169491525423728,0.8571428571428571,null,null,1.0714285714285714,0.91603053435114501,null,null,1.0909090909090908,0.93023255813953487,null,null,1.2,1.0344827586206897,null,null,null,null,1.0169491525423728,0.8571428571428571,1.4634146341463417,null,null,null,1.0909090909090908,0.93023255813953487,1.0657572205051691,null,null,null,1.1111111111111109,0.94488188976377963,1.0657572205051691,null,null,null,1.1320754716981132,0.97560975609756095,1.0990621336459554,null,null,null,1.1538461538461537,0.99173553719008267,1.0990621336459554,null,null,null,1.263157894736842,1.0909090909090908,1.0990621336459554,null,null,null,1.2903225806451613,1.1111111111111109,1.0990621336459554]
[1998,null,null,1.0169491525423728,0.8571428571428571,null,null,1.0714285714285714,0.91603053435114501,null,null,1.0909090909090908,0.93023255813953487,null,null,1.2,1.0344827586206897,null,null,null,null,1.0169491525423728,0.8571428571428571,1.4634146341463417,null,null,null,1.0909090909090908,0.93023255813953487,1.0657572205051691,null,null,null,1.1111111111111109,0.94488188976377963,1.0657572205051691,null,null,null,1.1320754716981132,0.97560975609756095,1.0990621336459554,null,null,null,1.1538461538461537,0.99173553719008267,1.0990621336459554,null,null,null,1.263157894736842,1.0909090909090908,1.0990621336459554,null,null,null,1.2903225806451613,1.1111111111111109,1.0990621336459554]
[1999,null,null,1.0169491525423728,0.8571428571428571,null,null,1.0714285714285714,0.91603053435114501,null,null,1.0909090909090908,0.93023255813953487,null,null,1.2,1.0344827586206897,null,null,null,null,1.0169491525423728,0.8571428571428571,1.4634146341463417,null,null,null,1.0909090909090908,0.93023255813953487,1.0657572205051691,null,null,null,1.1111111111111109,0.94488188976377963,1.0657572205051691,null,null,null,1.1320754716981132,0.97560975609756095,1.0990621336459554,null,null,null,1.1538461538461537,0.99173553719008267,1.0990621336459554,null,null,null,1.263157894736842,1.0909090909090908,1.0990621336459554,null,null,null,1.2903225806451613,1.1111111111111109,1.0990621336459554]
[2000,null,null,1.0169491525423728,0.8571428571428571,null,null,1.0714285714285714,0.91603053435114501,null,null,1.0909090909090908,0.93023255813953487,null,null,1.2,1.0344827586206897,null,null,null,null,1.0169491525423728,0.8571428571428571,1.4634146341463417,null,null,null,1.0909090909090908,0.93023255813953487,1.0657572205051691,null,null,null,1.1111111111111109,0.94488188976377963,1.0657572205051691,null,null,null,1.1320754716981132,0.97560975609756095,1.0990621336459554,null,null,null,1.1538461538461537,0.99173553719008267,1.0990621336459554,null,null,null,1.263157894736842,1.0909090909090908,1.0990621336459554,null,null,null,1.2903225806451613,1.1111111111111109,1.0990621336459554]
[2001,null,null,1.0169491525423728,0.8571428571428571,null,null,1.0714285714285714,0.91603053435114501,null,null,1.0909090909090908,0.93023255813953487,null,null,1.2,1.0344827586206897,null,null,null,null,1.0169491525423728,0.8571428571428571,1.4634146341463417,null,null,null,1.0909090909090908,0.93023255813953487,1.0657572205051691,null,null,null,1.1111111111111109,0.94488188976377963,1.0657572205051691,null,null,null,1.1320754716981132,0.97560975609756095,1.0990621336459554,null,null,null,1.1538461538461537,0.99173553719008267,1.0990621336459554,null,null,null,1.263157894736842,1.0909090909090908,1.0990621336459554,null,null,null,1.2903225806451613,1.1111111111111109,1.0990621336459554]
[2002,null,null,1.0169491525423728,0.8571428571428571,null,null,1.0714285714285714,0.91603053435114501,null,null,1.0909090909090908,0.93023255813953487,null,null,1.2,1.0344827586206897,null,null,null,null,1.0169491525423728,0.8571428571428571,1.4634146341463417,null,null,null,1.0909090909090908,0.93023255813953487,1.0657572205051691,null,null,null,1.1111111111111109,0.94488188976377963,1.0657572205051691,null,null,null,1.1320754716981132,0.97560975609756095,1.0990621336459554,null,null,null,1.1538461538461537,0.99173553719008267,1.0990621336459554,null,null,null,1.263157894736842,1.0909090909090908,1.0990621336459554,null,null,null,1.2903225806451613,1.1111111111111109,1.0990621336459554]
[2003,null,null,1.0169491525423728,0.8571428571428571,null,null,1.0714285714285714,0.91603053435114501,null,null,1.0909090909090908,0.93023255813953487,null,null,1.2,1.0344827586206897,null,null,null,null,1.0169491525423728,0.8571428571428571,1.4634146341463417,null,null,null,1.0909090909090908,0.93023255813953487,1.0657572205051691,null,null,null,1.1111111111111109,0.94488188976377963,1.0657572205051691,null,null,null,1.1320754716981132,0.97560975609756095,1.0990621336459554,null,null,null,1.1538461538461537,0.99173553719008267,1.0990621336459554,null,null,null,1.263157894736842,1.0909090909090908,1.0990621336459554,null,null,null,1.2903225806451613,1.1111111111111109,1.0990621336459554]
[2004,null,null,1.0169491525423728,0.8571428571428571,null,null,1.0714285714285714,0.91603053435114501,null,null,1.0909090909090908,0.93023255813953487,null,null,1.2,1.0344827586206897,null,null,null,null,1.0169491525423728,0.8571428571428571,1.4634146341463417,null,null,null,1.0909090909090908,0.93023255813953487,1.0657572205051691,null,null,null,1.1111111111111109,0.94488188976377963,1.0657572205051691,null,null,null,1.1320754716981132,0.97560975609756095,1.0990621336459554,null,null,null,1.1538461538461537,0.99173553719008267,1.0990621336459554,null,null,null,1.263157894736842,1.0909090909090908,1.0990621336459554,null,null,null,1.2903225806451613,1.1111111111111109,1.0990621336459554]
[2005,null,null,1.0169491525423728,0.8571428571428571,null,null,1.0714285714285714,0.91603053435114501,null,null,1.0909090909090908,0.93023255813953487,null,null,1.2,1.0344827586206897,null,null,null,null,1.0169491525423728,0.8571428571428571,1.4634146341463417,null,null,null,1.0909090909090908,0.93023255813953487,1.0657572205051691,null,null,null,1.1111111111111109,0.94488188976377963,1.0657572205051691,null,null,null,1.1320754716981132,0.97560975609756095,1.0990621336459554,null,null,null,1.1538461538461537,0.99173553719008267,1.0990621336459554,null,null,null,1.263157894736842,1.0909090909090908,1.0990621336459554,null,null,null,1.2903225806451613,1.1111111111111109,1.0990621336459554]
[2006,null,null,1.0169491525423728,0.8571428571428571,null,null,1.0714285714285714,0.91603053435114501,null,null,1.0909090909090908,0.93023255813953487,null,null,1.2,1.0344827586206897,null,null,null,null,1.0169491525423728,0.8571428571428571,1.4634146341463417,null,null,null,1.0909090909090908,0.93023255813953487,1.0657572205051691,null,null,null,1.1111111111111109,0.94488188976377963,1.0657572205051691,null,null,null,1.1320754716981132,0.97560975609756095,1.0990621336459554,null,null,null,1.1538461538461537,0.99173553719008267,1.0990621336459554,null,null,null,1.263157894736842,1.0909090909090908,1.0990621336459554,null,null,null,1.2903225806451613,1.1111111111111109,1.0990621336459554]
[2007,null,null,1.0169491525423728,0.8571428571428571,null,null,1.0714285714285714,0.91603053435114501,null,null,1.0909090909090908,0.93023255813953487,null,null,1.2,1.0344827586206897,null,null,null,null,1.0169491525423728,0.8571428571428571,1.4634146341463417,null,null,null,1.0909090909090908,0.93023255813953487,1.0657572205051691,null,null,null,1.1111111111111109,0.94488188976377963,1.0657572205051691,null,null,null,1.1320754716981132,0.97560975609756095,1.0990621336459554,null,null,null,1.1538461538461537,0.99173553719008267,1.0990621336459554,null,null,null,1.263157894736842,1.0909090909090908,1.0990621336459554,null,null,null,1.2903225806451613,1.1111111111111109,1.0990621336459554]
[2008,null,null,1.0169491525423728,0.8571428571428571,null,null,1.0714285714285714,0.91603053435114501,null,null,1.0909090909090908,0.93023255813953487,null,null,1.2,1.0344827586206897,null,null,null,null,1.0169491525423728,0.8571428571428571,1.4634146341463417,null,null,null,1.0909090909090908,0.93023255813953487,1.0657572205051691,null,null,null,1.1111111111111109,0.94488188976377963,1.0657572205051691,null,null,null,1.1320754716981132,0.97560975609756095,1.0990621336459554,null,null,null,1.1538461538461537,0.99173553719008267,1.0990621336459554,null,null,null,1.263157894736842,1.0909090909090908,1.0990621336459554,null,null,null,1.2903225806451613,1.1111111111111109,1.0990621336459554]
[2009,null,null,1.0169491525423728,0.8571428571428571,null,null,1.0714285714285714,0.91603053435114501,null,null,1.0909090909090908,0.93023255813953487,null,null,1.2,1.0344827586206897,null,null,null,null,1.0169491525423728,0.8571428571428571,1.4634146341463417,null,null,null,1.0909090909090908,0.93023255813953487,1.0657572205051691,null,null,null,1.1111111111111109,0.94488188976377963,1.0657572205051691,null,null,null,1.1320754716981132,0.97560975609756095,1.0990621336459554,null,null,null,1.1538461538461537,0.99173553719008267,1.0990621336459554,null,null,null,1.263157894736842,1.0909090909090908,1.0990621336459554,null,null,null,1.2903225806451613,1.1111111111111109,1.0990621336459554]
[2010,null,null,1.0169491525423728,0.8571428571428571,null,null,1.0714285714285714,0.91603053435114501,null,null,1.0909090909090908,0.93023255813953487,null,null,1.2,1.0344827586206897,null,null,null,null,1.0169491525423728,0.8571428571428571,1.4634146341463417,null,null,null,1.0909090909090908,0.93023255813953487,1.0657572205051691,null,null,null,1.1111111111111109,0.94488188976377963,1.0657572205051691,null,null,null,1.1320754716981132,0.97560975609756095,1.0990621336459554,null,null,null,1.1538461538461537,0.99173553719008267,1.0990621336459554,null,null,null,1.263157894736842,1.0909090909090908,1.0990621336459554,null,null,null,1.2903225806451613,1.1111111111111109,1.0990621336459554]
[2011,null,null,1.0169491525423728,0.8571428571428571,null,null,1.0714285714285714,0.91603053435114501,null,null,1.0909090909090908,0.93023255813953487,null,null,1.2,1.0344827586206897,null,null,null,null,1.0169491525423728,0.8571428571428571,1.4634146341463417,null,null,null,1.0909090909090908,0.93023255813953487,1.0657572205051691,null,null,null,1.1111111111111109,0.94488188976377963,1.0657572205051691,null,null,null,1.1320754716981132,0.97560975609756095,1.0990621336459554,null,null,null,1.1538461538461537,0.99173553719008267,1.0990621336459554,null,null,null,1.263157894736842,1.0909090909090908,1.0990621336459554,null,null,null,1.2903225806451613,1.1111111111111109,1.0990621336459554]
[2012,null,null,1.0169491525423728,0.8571428571428571,null,null,1.0714285714285714,0.91603053435114501,null,null,1.0909090909090908,0.93023255813953487,null,null,1.2,1.0344827586206897,null,null,null,null,1.0169491525423728,0.8571428571428571,1.4634146341463417,null,null,null,1.0909090909090908,0.93023255813953487,1.0657572205051691,null,null,null,1.1111111111111109,0.94488188976377963,1.0657572205051691,null,null,null,1.1320754716981132,0.97560975609756095,1.0990621336459554,null,null,null,1.1538461538461537,0.99173553719008267,1.0990621336459554,null,null,null,1.263157894736842,1.0909090909090908,1.0990621336459554,null,null,null,1.2903225806451613,1.1111111111111109,1.0990621336459554]
[2013,null,null,1.0169491525423728,0.8571428571428571,null,null,1.0714285714285714,0.91603053435114501,null,null,1.0909090909090908,0.93023255813953487,null,null,1.2,1.0344827586206897,null,null,null,null,1.0169491525423728,0.8571428571428571,1.4634146341463417,null,null,null,1.0909090909090908,0.93023255813953487,1.0657572205051691,null,null,null,1.1111111111111109,0.94488188976377963,1.0657572205051691,null,null,null,1.1320754716981132,0.97560975609756095,1.0990621336459554,null,null,null,1.1538461538461537,0.99173553719008267,1.0990621336459554,null,null,null,1.263157894736842,1.0909090909090908,1.0990621336459554,null,null,null,1.2903225806451613,1.1111111111111109,1.0990621336459554]
[2014,null,null,1.0169491525423728,0.8571428571428571,null,null,1.0714285714285714,0.91603053435114501,null,null,1.0909090909090908,0.93023255813953487,null,null,1.2,1.0344827586206897,null,null,null,null,1.0169491525423728,0.8571428571428571,1.4634146341463417,null,null,null,1.0909090909090908,0.93023255813953487,1.0657572205051691,null,null,null,1.1111111111111109,0.94488188976377963,1.0657572205051691,null,null,null,1.1320754716981132,0.97560975609756095,1.0990621336459554,null,null,null,1.1538461538461537,0.99173553719008267,1.0990621336459554,null,null,null,1.263157894736842,1.0909090909090908,1.0990621336459554,null,null,null,1.2903225806451613,1.1111111111111109,1.0990621336459554]
[2015,null,null,1.0169491525423728,0.8571428571428571,null,null,1.0714285714285714,0.91603053435114501,null,null,1.0909090909090908,0.93023255813953487,null,null,1.2,1.0344827586206897,null,null,null,null,1.0169491525423728,0.8571428571428571,1.4634146341463417,null,null,null,1.0909090909090908,0.93023255813953487,1.0657572205051691,null,null,null,1.1111111111111109,0.94488188976377963,1.0657572205051691,null,null,null,1.1320754716981132,0.97560975609756095,1.0990621336459554,null,null,null,1.1538461538461537,0.99173553719008267,1.0990621336459554,null,null,null,1.263157894736842,1.0909090909090908,1.0990621336459554,null,null,null,1.2903225806451613,1.1111111111111109,1.0990621336459554]
[2016,null,null,1.0169491525423728,0.8571428571428571,null,null,1.0714285714285714,0.91603053435114501,null,null,1.0909090909090908,0.93023255813953487,null,null,1.2,1.0344827586206897,null,null,null,null,1.0169491525423728,0.8571428571428571,1.4634146341463417,null,null,null,1.0909090909090908,0.93023255813953487,1.0657572205051691,null,null,null,1.1111111111111109,0.94488188976377963,1.0657572205051691,null,null,null,1.1320754716981132,0.97560975609756095,1.0990621336459554,null,null,null,1.1538461538461537,0.99173553719008267,1.0990621336459554,null,null,null,1.263157894736842,1.0909090909090908,1.0990621336459554,null,null,null,1.2903225806451613,1.1111111111111109,1.0990621336459554]
[2017,null,null,1.0169491525423728,0.8571428571428571,null,null,1.0714285714285714,0.91603053435114501,null,null,1.0909090909090908,0.93023255813953487,null,null,1.2,1.0344827586206897,null,null,null,null,1.0169491525423728,0.8571428571428571,1.4634146341463417,null,null,null,1.0909090909090908,0.93023255813953487,1.0657572205051691,null,null,null,1.1111111111111109,0.94488188976377963,1.0657572205051691,null,null,null,1.1320754716981132,0.97560975609756095,1.0990621336459554,null,null,null,1.1538461538461537,0.99173553719008267,1.0990621336459554,null,null,null,1.263157894736842,1.0909090909090908,1.0990621336459554,null,null,null,1.2903225806451613,1.1111111111111109,1.0990621336459554]
[2018,null,null,{"$f":"D$37","v":1.0169491525423728},{"$f":"E$37","v":0.8571428571428571},null,null,{"$f":"H$37","v":1.0714285714285714},{"$f":"I$37","v":0.91603053435114501},null,null,{"$f":"L$37","v":1.0909090909090908},{"$f":"M$37","v":0.93023255813953487},null,null,{"$f":"P$37","v":1.2},{"$f":"Q$37","v":1.0344827586206897},null,null,null,null,{"$f":"V36","v":1.0169491525423728},{"$f":"W36","v":0.8571428571428571},1.4634146341463417,null,null,null,{"$f":"AB36","v":1.0909090909090908},{"$f":"AC36","v":0.93023255813953487},1.0657572205051691,null,null,null,{"$f":"AH36","v":1.1111111111111109},{"$f":"AI36","v":0.94488188976377963},1.0657572205051691,null,null,null,{"$f":"AN36","v":1.1320754716981132},{"$f":"AO36","v":0.97560975609756095},1.0990621336459554,null,null,null,{"$f":"AT36","v":1.1538461538461537},{"$f":"AU36","v":0.99173553719008267},1.0990621336459554,null,null,null,{"$f":"AZ36","v":1.263157894736842},{"$f":"BA36","v":1.0909090909090908},1.0990621336459554,null,null,null,{"$f":"BF36","v":1.2903225806451613},{"$f":"BG36","v":1.1111111111111109},1.0990621336459554]
["ARTRM8",11.8,14,{"$f":"12/B36","v":1.0169491525423728},{"$f":"12/C36","v":0.8571428571428571},11.2,13.1,{"$f":"12/F36","v":1.0714285714285714},{"$f":"12/G36","v":0.91603053435114501},11,12.9,{"$f":"12/J36","v":1.0909090909090908},{"$f":"12/K36","v":0.93023255813953487},10,11.6,{"$f":"12/N36","v":1.2},{"$f":"12/O36","v":1.0344827586206897},null,11.8,14,8.1999999999999993,{"$f":"12/S36","v":1.0169491525423728},{"$f":"12/T36","v":0.8571428571428571},{"$f":"12/U36","v":1.4634146341463417},11,12.9,3.3,{"$f":"12/Y36","v":1.0909090909090908},{"$f":"12/Z36","v":0.93023255813953487},{"$f":"12/3.412/AA36","v":1.0657572205051691},10.8,12.7,3.3,{"$f":"12/AE36","v":1.1111111111111109},{"$f":"12/AF36","v":0.94488188976377963},{"$f":"12/3.412/AG36","v":1.0657572205051691},10.6,12.3,3.2,{"$f":"12/AK36","v":1.1320754716981132},{"$f":"12/AL36","v":0.97560975609756095},{"$f":"12/3.412/AM36","v":1.0990621336459554},10.4,12.1,3.2,{"$f":"12/AQ36","v":1.1538461538461537},{"$f":"12/AR36","v":0.99173553719008267},{"$f":"12/3.412/AS36","v":1.0990621336459554},9.5,11,3.2,{"$f":"12/AW36","v":1.263157894736842},{"$f":"12/AX36","v":1.0909090909090908},{"$f":"12/3.412/AY36","v":1.0990621336459554},9.3000000000000007,10.8,3.2,{"$f":"12/BC36","v":1.2903225806451613},{"$f":"12/BD36","v":1.1111111111111109},{"$f":"12/3.412/BE36","v":1.0990621336459554}]
["CPS",11.8,14,{"$f":"12/B37","v":1.0169491525423728},{"$f":"12/C37","v":0.8571428571428571},11.2,13.1,{"$f":"12/F37","v":1.0714285714285714},{"$f":"12/G37","v":0.91603053435114501},11,12.9,{"$f":"12/J37","v":1.0909090909090908},{"$f":"12/K37","v":0.93023255813953487},10,11.6,{"$f":"12/N37","v":1.2},{"$f":"12/O37","v":1.0344827586206897},null,11.8,14,8.1999999999999993,{"$f":"12/S37","v":1.0169491525423728},{"$f":"12/T37","v":0.8571428571428571},1.4634146341463417,11,12.9,3.3,{"$f":"12/Y37","v":1.0909090909090908},{"$f":"12/Z37","v":0.93023255813953487},{"$f":"12/3.412/AA37","v":1.0657572205051691},10.8,12.7,3.3,{"$f":"12/AE37","v":1.1111111111111109},{"$f":"12/AF37","v":0.94488188976377963},{"$f":"12/3.412/AG37","v":1.0657572205051691},10.6,12.3,3.2,{"$f":"12/AK37","v":1.1320754716981132},{"$f":"12/AL37","v":0.97560975609756095},{"$f":"12/3.412/AM37","v":1.0990621336459554},10.4,12.1,3.2,{"$f":"12/AQ37","v":1.1538461538461537},{"$f":"12/AR37","v":0.99173553719008267},{"$f":"12/3.412/AS37","v":1.0990621336459554},9.5,11,3.2,{"$f":"12/AW37","v":1.263157894736842},{"$f":"12/AX37","v":1.0909090909090908},{"$f":"12/3.412/AY37","v":1.0990621336459554},9.3000000000000007,10.8,3.2,{"$f":"12/BC37","v":1.2903225806451613},{"$f":"12/BD37","v":1.1111111111111109},{"$f":"12/3.412/BE37","v":1.0990621336459554}]

{"sheet":"Chiller","index":9,"n_rows":37,"n_cols":74,"rows_kept":37,"cut":false,"hidden":true,"merged":[]}
[null,"AirCooledChiller",null,null,null,"AirCooledChiller",null,null,null,"AirCooledChiller",null,null,null,"AirCooledChiller",null,null,null,"AirCooledChiller",null,null,null,"AirCooledChiller",null,null,null,"AirCooledChiller",null,null,null,"AirCooledChiller",null,null,null,"WaterCooledChiller",null,"WaterCooledChiller",null,"WaterCooledChiller",null,"WaterCooledChiller",null,"WaterCooledChiller",null,"WaterCooledChiller",null,"WaterCooledChiller",null,"WaterCooledChiller",null,"WaterCooledChiller",null,"WaterCooledChiller",null,"WaterCooledChiller",null,"WaterCooledChiller",null,"WaterCooledChiller",null,"WaterCooledChiller",null,"WaterCooledChiller",null,"WaterCooledChiller",null,"WaterCooledChiller",null,"WaterCooledChiller",null,"WaterCooledChiller",null,"WaterCooledChiller"]
[null,"Centrifugal",null,null,null,"Centrifugal",null,null,null,"Centrifugal",null,null,null,"Centrifugal",null,null,null,"ScrewScrollReciprocating",null,null,null,"ScrewScrollReciprocating",null,null,null,"ScrewScrollReciprocating",null,null,null,"ScrewScrollReciprocating",null,null,null,"ScrewScrollReciprocating",null,"ScrewScrollReciprocating",null,"ScrewScrollReciprocating",null,"ScrewScrollReciprocating",null,"ScrewScrollReciprocating",null,"ScrewScrollReciprocating",null,"ScrewScrollReciprocating",null,"ScrewScrollReciprocating",null,"ScrewScrollReciprocating",null,"ScrewScrollReciprocating",null,"Centrifugal",null,"Centrifugal",null,"Centrifugal",null,"Centrifugal",null,"Centrifugal",null,"Centrifugal",null,"Centrifugal",null,"Centrifugal",null,"Centrifugal",null,"Centrifugal"]
[null,"A",null,null,null,"B",null,null,null,"A",null,null,null,"B",null,null,null,"A",null,null,null,"B",null,null,null,"A",null,null,null,"B",null,null,null,"A",null,"B",null,"A",null,"B",null,"A",null,"B",null,"A",null,"B",null,"A",null,"B",null,"A",null,"B",null,"A",null,"B",null,"A",null,"B",null,"A",null,"B",null,"A",null,"B"]
[null,"Lessthan150tons",null,null,null,"Lessthan150tons",null,null,null,"Greaterthan150tons",null,null,null,"Greaterthan150tons",null,null,null,"Lessthan150tons",null,null,null,"Lessthan150tons",null,null,null,"Greaterthan150tons",null,null,null,"Greaterthan150tons",null,null,null,"Lessthan75tons",null,"Lessthan75tons",null,"75to150tons",null,"75to150tons",null,"150to300tons",null,"150to300tons",null,"300to600tons",null,"300to600tons",null,"Greaterthan600tons",null,"Greaterthan600tons",null,"Lessthan150tons",null,"Lessthan150tons",null,"150to300tons",null,"150to300tons",null,"300to400tons",null,"300to400tons",null,"400to600tons",null,"400to600tons",null,"Greaterthan600tons",null,"Greaterthan600tons"]
[null,{"$f":"B1&B2&B3&B4","v":"AirCooledChillerCentrifugalALessthan150tons"},null,null,null,{"$f":"F1&F2&F3&F4","v":"AirCooledChillerCentrifugalBLessthan150tons"},null,null,null,{"$f":"J1&J2&J3&J4","v":"AirCooledChillerCentrifugalAGreaterthan150tons"},null,null,null,{"$f":"N1&N2&N3&N4","v":"AirCooledChillerCentrifugalBGreaterthan150tons"},null,null,null,{"$f":"R1&R2&R3&R4","v":"AirCooledChillerScrewScrollReciprocatingALessthan150tons"},null,null,null,{"$f":"V1&V2&V3&V4","v":"AirCooledChillerScrewScrollReciprocatingBLessthan150tons"},null,null,null,{"$f":"Z1&Z2&Z3&Z4","v":"AirCooledChillerScrewScrollReciprocatingAGreaterthan150tons"},null,null,null,{"$f":"AD1&AD2&AD3&AD4","v":"AirCooledChillerScrewScrollReciprocatingBGreaterthan150tons"},null,null,null,{"$f":"AH1&AH2&AH3&AH4","v":"WaterCooledChillerScrewScrollReciprocatingALessthan75tons"},null,{"$f":"AJ1&AJ2&AJ3&AJ4","v":"WaterCooledChillerScrewScrollReciprocatingBLessthan75tons"},null,{"$f":"AL1&AL2&AL3&AL4","v":"WaterCooledChillerScrewScrollReciprocatingA75to150tons"},null,{"$f":"AN1&AN2&AN3&AN4","v":"WaterCooledChillerScrewScrollReciprocatingB75to150tons"},null,{"$f":"AP1&AP2&AP3&AP4","v":"WaterCooledChillerScrewScrollReciprocatingA150to300tons"},null,{"$f":"AR1&AR2&AR3&AR4","v":"WaterCooledChillerScrewScrollReciprocatingB150to300tons"},null,{"$f":"AT1&AT2&AT3&AT4","v":"WaterCooledChillerScrewScrollReciprocatingA300to600tons"},null,{"$f":"AV1&AV2&AV3&AV4","v":"WaterCooledChillerScrewScrollReciprocatingB300to600tons"},null,{"$f":"AX1&AX2&AX3&AX4","v":"WaterCooledChillerScrewScrollReciprocatingAGreaterthan600tons"},null,{"$f":"AZ1&AZ2&AZ3&AZ4","v":"WaterCooledChillerScrewScrollReciprocatingBGreaterthan600tons"},null,{"$f":"BB1&BB2&BB3&BB4","v":"WaterCooledChillerCentrifugalALessthan150tons"},null,{"$f":"BD1&BD2&BD3&BD4","v":"WaterCooledChillerCentrifugalBLessthan150tons"},null,{"$f":"BF1&BF2&BF3&BF4","v":"WaterCooledChillerCentrifugalA150to300tons"},null,{"$f":"BH1&BH2&BH3&BH4","v":"WaterCooledChillerCentrifugalB150to300tons"},null,{"$f":"BJ1&BJ2&BJ3&BJ4","v":"WaterCooledChillerCentrifugalA300to400tons"},null,{"$f":"BL1&BL2&BL3&BL4","v":"WaterCooledChillerCentrifugalB300to400tons"},null,{"$f":"BN1&BN2&BN3&BN4","v":"WaterCooledChillerCentrifugalA400to600tons"},null,{"$f":"BP1&BP2&BP3&BP4","v":"WaterCooledChillerCentrifugalB400to600tons"},null,{"$f":"BR1&BR2&BR3&BR4","v":"WaterCooledChillerCentrifugalAGreaterthan600tons"},null,{"$f":"BT1&BT2&BT3&BT4","v":"WaterCooledChillerCentrifugalBGreaterthan600tons"}]
[null,"Full","IPLV","Full","Part","Full","IPLV","Full","Part","Full","IPLV","Full","Part","Full","IPLV","Full","Part","Full","IPLV","Full","Part","Full","IPLV","Full","Part","Full","IPLV","Full","Part","Full","IPLV","Full","Part","Full","Part","Full","Part","Full","Part","Full","Part","Full","Part","Full","Part","Full","Part","Full","Part","Full","Part","Full","Part","Full","Part","Full","Part","Full","Part","Full","Part","Full","Part","Full","Part","Full","Part","Full","Part","Full","Part","Full","Part"]
["1972 - 1990",9.2119999999999997,9.5540000000000003,{"$f":"12/B7","v":1.302648719062093},{"$f":"12/C7","v":1.2560184216035168},9.2119999999999997,9.5540000000000003,{"$f":"12/F7","v":1.302648719062093},{"$f":"12/G7","v":1.2560184216035168},8.5299999999999994,8.5299999999999994,{"$f":"12/J7","v":1.4067995310668231},{"$f":"12/K7","v":1.4067995310668231},8.5299999999999994,8.5299999999999994,{"$f":"12/N7","v":1.4067995310668231},{"$f":"12/O7","v":1.4067995310668231},9.2119999999999997,9.5540000000000003,{"$f":"12/R7","v":1.302648719062093},{"$f":"12/S7","v":1.2560184216035168},9.2119999999999997,9.5540000000000003,{"$f":"12/V7","v":1.302648719062093},{"$f":"12/W7","v":1.2560184216035168},8.5299999999999994,8.5299999999999994,{"$f":"12/Z7","v":1.4067995310668231},{"$f":"12/AA7","v":1.4067995310668231},8.5299999999999994,8.5299999999999994,{"$f":"12/AD7","v":1.4067995310668231},{"$f":"12/AE7","v":1.4067995310668231},0.92500000000000004,0.90200000000000002,0.92500000000000004,0.90200000000000002,0.92500000000000004,0.90200000000000002,0.92500000000000004,0.90200000000000002,0.83699999999999997,0.78100000000000003,0.83699999999999997,0.78100000000000003,0.748,0.73299999999999998,0.748,0.73299999999999998,0.748,0.73299999999999998,0.748,0.73299999999999998,0.92500000000000004,0.90200000000000002,0.92500000000000004,0.90200000000000002,0.83699999999999997,0.78100000000000003,0.83699999999999997,0.78100000000000003,0.748,0.73299999999999998,0.748,0.73299999999999998,0.748,0.73299999999999998,0.748,0.73299999999999998,0.748,0.73299999999999998,0.748,0.73299999999999998,"ASHRAE 90.1--1989"]
[1991,9.2119999999999997,9.5540000000000003,1.302648719062093,1.2560184216035168,9.2119999999999997,9.5540000000000003,1.302648719062093,1.2560184216035168,8.5299999999999994,8.5299999999999994,1.4067995310668231,1.4067995310668231,8.5299999999999994,8.5299999999999994,1.4067995310668231,1.4067995310668231,9.2119999999999997,9.5540000000000003,1.302648719062093,1.2560184216035168,9.2119999999999997,9.5540000000000003,1.302648719062093,1.2560184216035168,8.5299999999999994,8.5299999999999994,1.4067995310668231,1.4067995310668231,8.5299999999999994,8.5299999999999994,1.4067995310668231,1.4067995310668231,0.92500000000000004,0.90200000000000002,0.92500000000000004,0.90200000000000002,0.92500000000000004,0.90200000000000002,0.92500000000000004,0.90200000000000002,0.83699999999999997,0.78100000000000003,0.83699999999999997,0.78100000000000003,0.748,0.73299999999999998,0.748,0.73299999999999998,0.748,0.73299999999999998,0.748,0.73299999999999998,0.92500000000000004,0.90200000000000002,0.92500000000000004,0.90200000000000002,0.83699999999999997,0.78100000000000003,0.83699999999999997,0.78100000000000003,0.748,0.73299999999999998,0.748,0.73299999999999998,0.748,0.73299999999999998,0.748,0.73299999999999998,0.748,0.73299999999999998,0.748,0.73299999999999998,"ASHRAE 90.1--1989"]
[1992,9.2119999999999997,9.5540000000000003,1.302648719062093,1.2560184216035168,9.2119999999999997,9.5540000000000003,1.302648719062093,1.2560184216035168,8.5299999999999994,8.5299999999999994,1.4067995310668231,1.4067995310668231,8.5299999999999994,8.5299999999999994,1.4067995310668231,1.4067995310668231,9.2119999999999997,9.5540000000000003,1.302648719062093,1.2560184216035168,9.2119999999999997,9.5540000000000003,1.302648719062093,1.2560184216035168,8.5299999999999994,8.5299999999999994,1.4067995310668231,1.4067995310668231,8.5299999999999994,8.5299999999999994,1.4067995310668231,1.4067995310668231,0.92500000000000004,0.90200000000000002,0.92500000000000004,0.90200000000000002,0.92500000000000004,0.90200000000000002,0.92500000000000004,0.90200000000000002,0.83699999999999997,0.78100000000000003,0.83699999999999997,0.78100000000000003,0.748,0.73299999999999998,0.748,0.73299999999999998,0.748,0.73299999999999998,0.748,0.73299999999999998,0.92500000000000004,0.90200000000000002,0.92500000000000004,0.90200000000000002,0.83699999999999997,0.78100000000000003,0.83699999999999997,0.78100000000000003,0.748,0.73299999999999998,0.748,0.73299999999999998,0.748,0.73299999999999998,0.748,0.73299999999999998,0.748,0.73299999999999998,0.748,0.73299999999999998,"ASHRAE 90.1--1989 (as of Jan. 1, 1992) "]
[1993,9.2119999999999997,9.5540000000000003,1.302648719062093,1.2560184216035168,9.2119999999999997,9.5540000000000003,1.302648719062093,1.2560184216035168,8.5299999999999994,8.5299999999999994,1.4067995310668231,1.4067995310668231,8.5299999999999994,8.5299999999999994,1.4067995310668231,1.4067995310668231,9.2119999999999997,9.5540000000000003,1.302648719062093,1.2560184216035168,9.2119999999999997,9.5540000000000003,1.302648719062093,1.2560184216035168,8.5299999999999994,8.5299999999999994,1.4067995310668231,1.4067995310668231,8.5299999999999994,8.5299999999999994,1.4067995310668231,1.4067995310668231,0.92500000000000004,0.90200000000000002,0.92500000000000004,0.90200000000000002,0.92500000000000004,0.90200000000000002,0.92500000000000004,0.90200000000000002,0.83699999999999997,0.78100000000000003,0.83699999999999997,0.78100000000000003,0.748,0.73299999999999998,0.748,0.73299999999999998,0.748,0.73299999999999998,0.748,0.73299999999999998,0.92500000000000004,0.90200000000000002,0.92500000000000004,0.90200000000000002,0.83699999999999997,0.78100000000000003,0.83699999999999997,0.78100000000000003,0.748,0.73299999999999998,0.748,0.73299999999999998,0.748,0.73299999999999998,0.748,0.73299999999999998,0.748,0.73299999999999998,0.748,0.73299999999999998,"ASHRAE 90.1--1989 (as of Jan. 1, 1992) "]
[1994,9.2119999999999997,9.5540000000000003,1.302648719062093,1.2560184216035168,9.2119999999999997,9.5540000000000003,1.302648719062093,1.2560184216035168,8.5299999999999994,8.5299999999999994,1.4067995310668231,1.4067995310668231,8.5299999999999994,8.5299999999999994,1.4067995310668231,1.4067995310668231,9.2119999999999997,9.5540000000000003,1.302648719062093,1.2560184216035168,9.2119999999999997,9.5540000000000003,1.302648719062093,1.2560184216035168,8.5299999999999994,8.5299999999999994,1.4067995310668231,1.4067995310668231,8.5299999999999994,8.5299999999999994,1.4067995310668231,1.4067995310668231,0.92500000000000004,0.90200000000000002,0.92500000000000004,0.90200000000000002,0.92500000000000004,0.90200000000000002,0.92500000000000004,0.90200000000000002,0.83699999999999997,0.78100000000000003,0.83699999999999997,0.78100000000000003,0.748,0.73299999999999998,0.748,0.73299999999999998,0.748,0.73299999999999998,0.748,0.73299999999999998,0.92500000000000004,0.90200000000000002,0.92500000000000004,0.90200000000000002,0.83699999999999997,0.78100000000000003,0.83699999999999997,0.78100000000000003,0.748,0.73299999999999998,0.748,0.73299999999999998,0.748,0.73299999999999998,0.748,0.73299999999999998,0.748,0.73299999999999998,0.748,0.73299999999999998,"ASHRAE 90.1--1989 (as of Jan. 1, 1992) "]
[1995,9.2119999999999997,9.5540000000000003,1.302648719062093,1.2560184216035168,9.2119999999999997,9.5540000000000003,1.302648719062093,1.2560184216035168,8.5299999999999994,8.5299999999999994,1.4067995310668231,1.4067995310668231,8.5299999999999994,8.5299999999999994,1.4067995310668231,1.4067995310668231,9.2119999999999997,9.5540000000000003,1.302648719062093,1.2560184216035168,9.2119999999999997,9.5540000000000003,1.302648719062093,1.2560184216035168,8.5299999999999994,8.5299999999999994,1.4067995310668231,1.4067995310668231,8.5299999999999994,8.5299999999999994,1.4067995310668231,1.4067995310668231,0.92500000000000004,0.90200000000000002,0.92500000000000004,0.90200000000000002,0.92500000000000004,0.90200000000000002,0.92500000000000004,0.90200000000000002,0.83699999999999997,0.78100000000000003,0.83699999999999997,0.78100000000000003,0.748,0.73299999999999998,0.748,0.73299999999999998,0.748,0.73299999999999998,0.748,0.73299999999999998,0.92500000000000004,0.90200000000000002,0.92500000000000004,0.90200000000000002,0.83699999999999997,0.78100000000000003,0.83699999999999997,0.78100000000000003,0.748,0.73299999999999998,0.748,0.73299999999999998,0.748,0.73299999999999998,0.748,0.73299999999999998,0.748,0.73299999999999998,0.748,0.73299999999999998,"ASHRAE 90.1--1989 (as of Jan. 1, 1992) "]
[1996,9.2119999999999997,9.5540000000000003,1.302648719062093,1.2560184216035168,9.2119999999999997,9.5540000000000003,1.302648719062093,1.2560184216035168,8.5299999999999994,8.5299999999999994,1.4067995310668231,1.4067995310668231,8.5299999999999994,8.5299999999999994,1.4067995310668231,1.4067995310668231,9.2119999999999997,9.5540000000000003,1.302648719062093,1.2560184216035168,9.2119999999999997,9.5540000000000003,1.302648719062093,1.2560184216035168,8.5299999999999994,8.5299999999999994,1.4067995310668231,1.4067995310668231,8.5299999999999994,8.5299999999999994,1.4067995310668231,1.4067995310668231,0.92500000000000004,0.90200000000000002,0.92500000000000004,0.90200000000000002,0.92500000000000004,0.90200000000000002,0.92500000000000004,0.90200000000000002,0.83699999999999997,0.78100000000000003,0.83699999999999997,0.78100000000000003,0.748,0.73299999999999998,0.748,0.73299999999999998,0.748,0.73299999999999998,0.748,0.73299999999999998,0.92500000000000004,0.90200000000000002,0.92500000000000004,0.90200000000000002,0.83699999999999997,0.78100000000000003,0.83699999999999997,0.78100000000000003,0.748,0.73299999999999998,0.748,0.73299999999999998,0.748,0.73299999999999998,0.748,0.73299999999999998,0.748,0.73299999999999998,0.748,0.73299999999999998,"ASHRAE 90.1--1989 (as of Jan. 1, 1992) "]
[1997,9.2119999999999997,9.5540000000000003,1.302648719062093,1.2560184216035168,9.2119999999999997,9.5540000000000003,1.302648719062093,1.2560184216035168,8.5299999999999994,8.5299999999999994,1.4067995310668231,1.4067995310668231,8.5299999999999994,8.5299999999999994,1.4067995310668231,1.4067995310668231,9.2119999999999997,9.5540000000000003,1.302648719062093,1.2560184216035168,9.2119999999999997,9.5540000000000003,1.302648719062093,1.2560184216035168,8.5299999999999994,8.5299999999999994,1.4067995310668231,1.4067995310668231,8.5299999999999994,8.5299999999999994,1.4067995310668231,1.4067995310668231,0.92500000000000004,0.90200000000000002,0.92500000000000004,0.90200000000000002,0.92500000000000004,0.90200000000000002,0.92500000000000004,0.90200000000000002,0.83699999999999997,0.78100000000000003,0.83699999999999997,0.78100000000000003,0.748,0.73299999999999998,0.748,0.73299999999999998,0.748,0.73299999999999998,0.748,0.73299999999999998,0.92500000000000004,0.90200000000000002,0.92500000000000004,0.90200000000000002,0.83699999999999997,0.78100000000000003,0.83699999999999997,0.78100000000000003,0.748,0.73299999999999998,0.748,0.73299999999999998,0.748,0.73299999999999998,0.748,0.73299999999999998,0.748,0.73299999999999998,0.748,0.73299999999999998,"ASHRAE 90.1--1989 (as of Jan. 1, 1992) "]
[1998,9.2119999999999997,9.5540000000000003,1.302648719062093,1.2560184216035168,9.2119999999999997,9.5540000000000003,1.302648719062093,1.2560184216035168,8.5299999999999994,8.5299999999999994,1.4067995310668231,1.4067995310668231,8.5299999999999994,8.5299999999999994,1.4067995310668231,1.4067995310668231,9.2119999999999997,9.5540000000000003,1.302648719062093,1.2560184216035168,9.2119999999999997,9.5540000000000003,1.302648719062093,1.2560184216035168,8.5299999999999994,8.5299999999999994,1.4067995310668231,1.4067995310668231,8.5299999999999994,8.5299999999999994,1.4067995310668231,1.4067995310668231,0.92500000000000004,0.90200000000000002,0.92500000000000004,0.90200000000000002,0.92500000000000004,0.90200000000000002,0.92500000000000004,0.90200000000000002,0.83699999999999997,0.78100000000000003,0.83699999999999997,0.78100000000000003,0.748,0.73299999999999998,0.748,0.73299999999999998,0.748,0.73299999999999998,0.748,0.73299999999999998,0.92500000000000004,0.90200000000000002,0.92500000000000004,0.90200000000000002,0.83699999999999997,0.78100000000000003,0.83699999999999997,0.78100000000000003,0.748,0.73299999999999998,0.748,0.73299999999999998,0.748,0.73299999999999998,0.748,0.73299999999999998,0.748,0.73299999999999998,0.748,0.73299999999999998,"ASHRAE 90.1--1989 (as of Jan. 1, 1992) "]
[1999,9.2119999999999997,9.5540000000000003,1.302648719062093,1.2560184216035168,9.2119999999999997,9.5540000000000003,1.302648719062093,1.2560184216035168,8.5299999999999994,8.5299999999999994,1.4067995310668231,1.4067995310668231,8.5299999999999994,8.5299999999999994,1.4067995310668231,1.4067995310668231,9.2119999999999997,9.5540000000000003,1.302648719062093,1.2560184216035168,9.2119999999999997,9.5540000000000003,1.302648719062093,1.2560184216035168,8.5299999999999994,8.5299999999999994,1.4067995310668231,1.4067995310668231,8.5299999999999994,8.5299999999999994,1.4067995310668231,1.4067995310668231,0.92500000000000004,0.90200000000000002,0.92500000000000004,0.90200000000000002,0.92500000000000004,0.90200000000000002,0.92500000000000004,0.90200000000000002,0.83699999999999997,0.78100000000000003,0.83699999999999997,0.78100000000000003,0.748,0.73299999999999998,0.748,0.73299999999999998,0.748,0.73299999999999998,0.748,0.73299999999999998,0.92500000000000004,0.90200000000000002,0.92500000000000004,0.90200000000000002,0.83699999999999997,0.78100000000000003,0.83699999999999997,0.78100000000000003,0.748,0.73299999999999998,0.748,0.73299999999999998,0.748,0.73299999999999998,0.748,0.73299999999999998,0.748,0.73299999999999998,0.748,0.73299999999999998,"ASHRAE 90.1--1999"]
[2000,9.2119999999999997,9.5540000000000003,1.302648719062093,1.2560184216035168,9.2119999999999997,9.5540000000000003,1.302648719062093,1.2560184216035168,8.5299999999999994,8.5299999999999994,1.4067995310668231,1.4067995310668231,8.5299999999999994,8.5299999999999994,1.4067995310668231,1.4067995310668231,9.2119999999999997,9.5540000000000003,1.302648719062093,1.2560184216035168,9.2119999999999997,9.5540000000000003,1.302648719062093,1.2560184216035168,8.5299999999999994,8.5299999999999994,1.4067995310668231,1.4067995310668231,8.5299999999999994,8.5299999999999994,1.4067995310668231,1.4067995310668231,0.92500000000000004,0.90200000000000002,0.92500000000000004,0.90200000000000002,0.92500000000000004,0.90200000000000002,0.92500000000000004,0.90200000000000002,0.83699999999999997,0.78100000000000003,0.83699999999999997,0.78100000000000003,0.748,0.73299999999999998,0.748,0.73299999999999998,0.748,0.73299999999999998,0.748,0.73299999999999998,0.92500000000000004,0.90200000000000002,0.92500000000000004,0.90200000000000002,0.83699999999999997,0.78100000000000003,0.83699999999999997,0.78100000000000003,0.748,0.73299999999999998,0.748,0.73299999999999998,0.748,0.73299999999999998,0.748,0.73299999999999998,0.748,0.73299999999999998,0.748,0.73299999999999998,"ASHRAE 90.1--1999"]
[2001,9.2119999999999997,9.5540000000000003,1.302648719062093,1.2560184216035168,9.2119999999999997,9.5540000000000003,1.302648719062093,1.2560184216035168,8.5299999999999994,8.5299999999999994,1.4067995310668231,1.4067995310668231,8.5299999999999994,8.5299999999999994,1.4067995310668231,1.4067995310668231,9.2119999999999997,9.5540000000000003,1.302648719062093,1.2560184216035168,9.2119999999999997,9.5540000000000003,1.302648719062093,1.2560184216035168,8.5299999999999994,8.5299999999999994,1.4067995310668231,1.4067995310668231,8.5299999999999994,8.5299999999999994,1.4067995310668231,1.4067995310668231,0.92500000000000004,0.90200000000000002,0.92500000000000004,0.90200000000000002,0.92500000000000004,0.90200000000000002,0.92500000000000004,0.90200000000000002,0.83699999999999997,0.78100000000000003,0.83699999999999997,0.78100000000000003,0.748,0.73299999999999998,0.748,0.73299999999999998,0.748,0.73299999999999998,0.748,0.73299999999999998,0.92500000000000004,0.90200000000000002,0.92500000000000004,0.90200000000000002,0.83699999999999997,0.78100000000000003,0.83699999999999997,0.78100000000000003,0.748,0.73299999999999998,0.748,0.73299999999999998,0.748,0.73299999999999998,0.748,0.73299999999999998,0.748,0.73299999999999998,0.748,0.73299999999999998,"ASHRAE 90.1--1999 "]
[2002,9.5619999999999994,10.416,1.2549675800041833,1.1520737327188939,9.5619999999999994,10.416,1.2549675800041833,1.1520737327188939,9.5619999999999994,10.416,1.2549675800041833,1.1520737327188939,9.5619999999999994,10.416,1.2549675800041833,1.1520737327188939,9.5619999999999994,10.416,1.2549675800041833,1.1520737327188939,9.5619999999999994,10.416,1.2549675800041833,1.1520737327188939,9.5619999999999994,10.416,1.2549675800041833,1.1520737327188939,9.5619999999999994,10.416,1.2549675800041833,1.1520737327188939,0.79,0.67600000000000005,0.79,0.67600000000000005,0.79,0.67600000000000005,0.79,0.67600000000000005,0.71799999999999997,0.628,0.71799999999999997,0.628,0.63900000000000001,0.57199999999999995,0.63900000000000001,0.57199999999999995,0.63900000000000001,0.57199999999999995,0.63900000000000001,0.57199999999999995,0.70299999999999996,0.67,0.70299999999999996,0.67,0.63400000000000001,0.59599999999999997,0.63400000000000001,0.59599999999999997,0.57599999999999996,0.54900000000000004,0.57599999999999996,0.54900000000000004,0.57599999999999996,0.54900000000000004,0.57599999999999996,0.54900000000000004,0.57599999999999996,0.54900000000000004,0.57599999999999996,0.54900000000000004,"ASHRAE 90.1--1999 (as of 10/29/2001)"]
[2003,9.5619999999999994,10.416,1.2549675800041833,1.1520737327188939,9.5619999999999994,10.416,1.2549675800041833,1.1520737327188939,9.5619999999999994,10.416,1.2549675800041833,1.1520737327188939,9.5619999999999994,10.416,1.2549675800041833,1.1520737327188939,9.5619999999999994,10.416,1.2549675800041833,1.1520737327188939,9.5619999999999994,10.416,1.2549675800041833,1.1520737327188939,9.5619999999999994,10.416,1.2549675800041833,1.1520737327188939,9.5619999999999994,10.416,1.2549675800041833,1.1520737327188939,0.79,0.67600000000000005,0.79,0.67600000000000005,0.79,0.67600000000000005,0.79,0.67600000000000005,0.71799999999999997,0.628,0.71799999999999997,0.628,0.63900000000000001,0.57199999999999995,0.63900000000000001,0.57199999999999995,0.63900000000000001,0.57199999999999995,0.63900000000000001,0.57199999999999995,0.70299999999999996,0.67,0.70299999999999996,0.67,0.63400000000000001,0.59599999999999997,0.63400000000000001,0.59599999999999997,0.57599999999999996,0.54900000000000004,0.57599999999999996,0.54900000000000004,0.57599999999999996,0.54900000000000004,0.57599999999999996,0.54900000000000004,0.57599999999999996,0.54900000000000004,0.57599999999999996,0.54900000000000004,"ASHRAE 90.1--1999 (as of 10/29/2001)"]
[2004,9.5619999999999994,10.416,1.2549675800041833,1.1520737327188939,9.5619999999999994,10.416,1.2549675800041833,1.1520737327188939,9.5619999999999994,10.416,1.2549675800041833,1.1520737327188939,9.5619999999999994,10.416,1.2549675800041833,1.1520737327188939,9.5619999999999994,10.416,1.2549675800041833,1.1520737327188939,9.5619999999999994,10.416,1.2549675800041833,1.1520737327188939,9.5619999999999994,10.416,1.2549675800041833,1.1520737327188939,9.5619999999999994,10.416,1.2549675800041833,1.1520737327188939,0.79,0.67600000000000005,0.79,0.67600000000000005,0.79,0.67600000000000005,0.79,0.67600000000000005,0.71799999999999997,0.628,0.71799999999999997,0.628,0.63900000000000001,0.57199999999999995,0.63900000000000001,0.57199999999999995,0.63900000000000001,0.57199999999999995,0.63900000000000001,0.57199999999999995,0.70299999999999996,0.67,0.70299999999999996,0.67,0.63400000000000001,0.59599999999999997,0.63400000000000001,0.59599999999999997,0.57599999999999996,0.54900000000000004,0.57599999999999996,0.54900000000000004,0.57599999999999996,0.54900000000000004,0.57599999999999996,0.54900000000000004,0.57599999999999996,0.54900000000000004,0.57599999999999996,0.54900000000000004,"ASHRAE 90.1--2004"]
[2005,9.5619999999999994,10.416,1.2549675800041833,1.1520737327188939,9.5619999999999994,10.416,1.2549675800041833,1.1520737327188939,9.5619999999999994,10.416,1.2549675800041833,1.1520737327188939,9.5619999999999994,10.416,1.2549675800041833,1.1520737327188939,9.5619999999999994,10.416,1.2549675800041833,1.1520737327188939,9.5619999999999994,10.416,1.2549675800041833,1.1520737327188939,9.5619999999999994,10.416,1.2549675800041833,1.1520737327188939,9.5619999999999994,10.416,1.2549675800041833,1.1520737327188939,0.79,0.67600000000000005,0.79,0.67600000000000005,0.79,0.67600000000000005,0.79,0.67600000000000005,0.71799999999999997,0.628,0.71799999999999997,0.628,0.63900000000000001,0.57199999999999995,0.63900000000000001,0.57199999999999995,0.63900000000000001,0.57199999999999995,0.63900000000000001,0.57199999999999995,0.70299999999999996,0.67,0.70299999999999996,0.67,0.63400000000000001,0.59599999999999997,0.63400000000000001,0.59599999999999997,0.57599999999999996,0.54900000000000004,0.57599999999999996,0.54900000000000004,0.57599999999999996,0.54900000000000004,0.57599999999999996,0.54900000000000004,0.57599999999999996,0.54900000000000004,0.57599999999999996,0.54900000000000004,"ASHRAE 90.1--2004"]
[2006,9.5619999999999994,10.416,1.2549675800041833,1.1520737327188939,9.5619999999999994,10.416,1.2549675800041833,1.1520737327188939,9.5619999999999994,10.416,1.2549675800041833,1.1520737327188939,9.5619999999999994,10.416,1.2549675800041833,1.1520737327188939,9.5619999999999994,10.416,1.2549675800041833,1.1520737327188939,9.5619999999999994,10.416,1.2549675800041833,1.1520737327188939,9.5619999999999994,10.416,1.2549675800041833,1.1520737327188939,9.5619999999999994,10.416,1.2549675800041833,1.1520737327188939,0.79,0.67600000000000005,0.79,0.67600000000000005,0.79,0.67600000000000005,0.79,0.67600000000000005,0.71799999999999997,0.628,0.71799999999999997,0.628,0.63900000000000001,0.57199999999999995,0.63900000000000001,0.57199999999999995,0.63900000000000001,0.57199999999999995,0.63900000000000001,0.57199999999999995,0.70299999999999996,0.67,0.70299999999999996,0.67,0.63400000000000001,0.59599999999999997,0.63400000000000001,0.59599999999999997,0.57599999999999996,0.54900000000000004,0.57599999999999996,0.54900000000000004,0.57599999999999996,0.54900000000000004,0.57599999999999996,0.54900000000000004,0.57599999999999996,0.54900000000000004,0.57599999999999996,0.54900000000000004,"Federal Standard/ASHRAE 90.1--2004"]
[2007,9.5619999999999994,10.416,1.2549675800041833,1.1520737327188939,9.5619999999999994,10.416,1.2549675800041833,1.1520737327188939,9.5619999999999994,10.416,1.2549675800041833,1.1520737327188939,9.5619999999999994,10.416,1.2549675800041833,1.1520737327188939,9.5619999999999994,10.416,1.2549675800041833,1.1520737327188939,9.5619999999999994,10.416,1.2549675800041833,1.1520737327188939,9.5619999999999994,10.416,1.2549675800041833,1.1520737327188939,9.5619999999999994,10.416,1.2549675800041833,1.1520737327188939,0.79,0.67600000000000005,0.79,0.67600000000000005,0.79,0.67600000000000005,0.79,0.67600000000000005,0.71799999999999997,0.628,0.71799999999999997,0.628,0.63900000000000001,0.57199999999999995,0.63900000000000001,0.57199999999999995,0.63900000000000001,0.57199999999999995,0.63900000000000001,0.57199999999999995,0.70299999999999996,0.67,0.70299999999999996,0.67,0.63400000000000001,0.59599999999999997,0.63400000000000001,0.59599999999999997,0.57599999999999996,0.54900000000000004,0.57599999999999996,0.54900000000000004,0.57599999999999996,0.54900000000000004,0.57599999999999996,0.54900000000000004,0.57599999999999996,0.54900000000000004,0.57599999999999996,0.54900000000000004,"Federal Standard/ASHRAE 90.1-2007 "]
[2008,9.5619999999999994,10.416,1.2549675800041833,1.1520737327188939,9.5619999999999994,10.416,1.2549675800041833,1.1520737327188939,9.5619999999999994,10.416,1.2549675800041833,1.1520737327188939,9.5619999999999994,10.416,1.2549675800041833,1.1520737327188939,9.5619999999999994,10.416,1.2549675800041833,1.1520737327188939,9.5619999999999994,10.416,1.2549675800041833,1.1520737327188939,9.5619999999999994,10.416,1.2549675800041833,1.1520737327188939,9.5619999999999994,10.416,1.2549675800041833,1.1520737327188939,0.79,0.67600000000000005,0.79,0.67600000000000005,0.79,0.67600000000000005,0.79,0.67600000000000005,0.71799999999999997,0.628,0.71799999999999997,0.628,0.63900000000000001,0.57199999999999995,0.63900000000000001,0.57199999999999995,0.63900000000000001,0.57199999999999995,0.63900000000000001,0.57199999999999995,0.70299999999999996,0.67,0.70299999999999996,0.67,0.63400000000000001,0.59599999999999997,0.63400000000000001,0.59599999999999997,0.57599999999999996,0.54900000000000004,0.57599999999999996,0.54900000000000004,0.57599999999999996,0.54900000000000004,0.57599999999999996,0.54900000000000004,0.57599999999999996,0.54900000000000004,0.57599999999999996,0.54900000000000004,"Federal Standard/ASHRAE 90.1-2007 "]
[2009,9.5619999999999994,10.416,1.2549675800041833,1.1520737327188939,9.5619999999999994,10.416,1.2549675800041833,1.1520737327188939,9.5619999999999994,10.416,1.2549675800041833,1.1520737327188939,9.5619999999999994,10.416,1.2549675800041833,1.1520737327188939,9.5619999999999994,10.416,1.2549675800041833,1.1520737327188939,9.5619999999999994,10.416,1.2549675800041833,1.1520737327188939,9.5619999999999994,10.416,1.2549675800041833,1.1520737327188939,9.5619999999999994,10.416,1.2549675800041833,1.1520737327188939,0.79,0.67600000000000005,0.79,0.67600000000000005,0.79,0.67600000000000005,0.79,0.67600000000000005,0.71799999999999997,0.628,0.71799999999999997,0.628,0.63900000000000001,0.57199999999999995,0.63900000000000001,0.57199999999999995,0.63900000000000001,0.57199999999999995,0.63900000000000001,0.57199999999999995,0.70299999999999996,0.67,0.70299999999999996,0.67,0.63400000000000001,0.59599999999999997,0.63400000000000001,0.59599999999999997,0.57599999999999996,0.54900000000000004,0.57599999999999996,0.54900000000000004,0.57599999999999996,0.54900000000000004,0.57599999999999996,0.54900000000000004,0.57599999999999996,0.54900000000000004,0.57599999999999996,0.54900000000000004,"Federal Standard/ASHRAE 90.1-2007"]
[2010,9.5619999999999994,12.5,1.2549675800041833,0.96,9.5619999999999994,12.5,1.2549675800041833,0.96,9.5619999999999994,12.5,1.2549675800041833,0.96,9.5619999999999994,12.5,1.2549675800041833,0.96,9.5619999999999994,12.5,1.2549675800041833,0.96,9.5619999999999994,12.5,1.2549675800041833,0.96,9.5619999999999994,12.5,1.2549675800041833,0.96,9.5619999999999994,12.5,1.2549675800041833,0.96,0.78,0.63,0.8,0.6,0.77500000000000002,0.61499999999999999,0.79,0.58599999999999997,0.68,0.57999999999999996,0.71799999999999997,0.54,0.62,0.54,0.63900000000000001,0.49,0.62,0.54,0.63900000000000001,0.49,0.63400000000000001,0.59599999999999997,0.63900000000000001,0.45,0.63400000000000001,0.59599999999999997,0.63900000000000001,0.45,0.57599999999999996,0.54900000000000004,0.6,0.4,0.57599999999999996,0.54900000000000004,0.6,0.4,0.56999999999999995,0.53900000000000003,0.59,0.4,"Federal Standard/ASHRAE 90.1-2007 (as of 1/1/2010)"]
[2011,9.5619999999999994,12.5,1.2549675800041833,0.96,9.5619999999999994,12.5,1.2549675800041833,0.96,9.5619999999999994,12.5,1.2549675800041833,0.96,9.5619999999999994,12.5,1.2549675800041833,0.96,9.5619999999999994,12.5,1.2549675800041833,0.96,9.5619999999999994,12.5,1.2549675800041833,0.96,9.5619999999999994,12.5,1.2549675800041833,0.96,9.5619999999999994,12.5,1.2549675800041833,0.96,0.78,0.63,0.8,0.6,0.77500000000000002,0.61499999999999999,0.79,0.58599999999999997,0.68,0.57999999999999996,0.71799999999999997,0.54,0.62,0.54,0.63900000000000001,0.49,0.62,0.54,0.63900000000000001,0.49,0.63400000000000001,0.59599999999999997,0.63900000000000001,0.45,0.63400000000000001,0.59599999999999997,0.63900000000000001,0.45,0.57599999999999996,0.54900000000000004,0.6,0.4,0.57599999999999996,0.54900000000000004,0.6,0.4,0.56999999999999995,0.53900000000000003,0.59,0.4,"Federal Standard/ASHRAE 90.1-2007 (as of 1/1/2010)"]
[2012,9.5619999999999994,12.5,1.2549675800041833,0.96,9.5619999999999994,12.5,1.2549675800041833,0.96,9.5619999999999994,12.5,1.2549675800041833,0.96,9.5619999999999994,12.5,1.2549675800041833,0.96,9.5619999999999994,12.5,1.2549675800041833,0.96,9.5619999999999994,12.5,1.2549675800041833,0.96,9.5619999999999994,12.5,1.2549675800041833,0.96,9.5619999999999994,12.5,1.2549675800041833,0.96,0.78,1.63,0.8,0.6,0.77500000000000002,0.61499999999999999,0.79,0.58599999999999997,0.68,0.57999999999999996,0.71799999999999997,0.54,0.62,0.54,0.63900000000000001,0.49,0.62,0.54,0.63900000000000001,0.49,0.63400000000000001,0.59599999999999997,0.63900000000000001,0.45,0.63400000000000001,0.59599999999999997,0.63900000000000001,0.45,0.57599999999999996,0.54900000000000004,0.6,0.4,0.57599999999999996,0.54900000000000004,0.6,0.4,0.56999999999999995,0.53900000000000003,0.59,0.4,"Federal Standard/ASHRAE 90.1-2007 (as of 1/1/2010)"]
[2013,9.5619999999999994,12.5,1.2549675800041833,0.96,9.5619999999999994,12.5,1.2549675800041833,0.96,9.5619999999999994,12.5,1.2549675800041833,0.96,9.5619999999999994,12.5,1.2549675800041833,0.96,9.5619999999999994,12.5,1.2549675800041833,0.96,9.5619999999999994,12.5,1.2549675800041833,0.96,9.5619999999999994,12.5,1.2549675800041833,0.96,9.5619999999999994,12.5,1.2549675800041833,0.96,0.78,2.63,0.8,0.6,0.77500000000000002,0.61499999999999999,0.79,0.58599999999999997,0.68,0.57999999999999996,0.71799999999999997,0.54,0.62,0.54,0.63900000000000001,0.49,0.62,0.54,0.63900000000000001,0.49,0.63400000000000001,0.59599999999999997,0.63900000000000001,0.45,0.63400000000000001,0.59599999999999997,0.63900000000000001,0.45,0.57599999999999996,0.54900000000000004,0.6,0.4,0.57599999999999996,0.54900000000000004,0.6,0.4,0.56999999999999995,0.53900000000000003,0.59,0.4]
[2014,9.5619999999999994,12.5,1.2549675800041833,0.96,9.5619999999999994,12.5,1.2549675800041833,0.96,9.5619999999999994,12.5,1.2549675800041833,0.96,9.5619999999999994,12.5,1.2549675800041833,0.96,9.5619999999999994,12.5,1.2549675800041833,0.96,9.5619999999999994,12.5,1.2549675800041833,0.96,9.5619999999999994,12.5,1.2549675800041833,0.96,9.5619999999999994,12.5,1.2549675800041833,0.96,0.78,3.63,0.8,0.6,0.77500000000000002,0.61499999999999999,0.79,0.58599999999999997,0.68,0.57999999999999996,0.71799999999999997,0.54,0.62,0.54,0.63900000000000001,0.49,0.62,0.54,0.63900000000000001,0.49,0.63400000000000001,0.59599999999999997,0.63900000000000001,0.45,0.63400000000000001,0.59599999999999997,0.63900000000000001,0.45,0.57599999999999996,0.54900000000000004,0.6,0.4,0.57599999999999996,0.54900000000000004,0.6,0.4,0.56999999999999995,0.53900000000000003,0.59,0.4]
[2015,9.5619999999999994,12.5,1.2549675800041833,0.96,9.5619999999999994,12.5,1.2549675800041833,0.96,9.5619999999999994,12.5,1.2549675800041833,0.96,9.5619999999999994,12.5,1.2549675800041833,0.96,9.5619999999999994,12.5,1.2549675800041833,0.96,9.5619999999999994,12.5,1.2549675800041833,0.96,9.5619999999999994,12.5,1.2549675800041833,0.96,9.5619999999999994,12.5,1.2549675800041833,0.96,0.78,4.63,0.8,0.6,0.77500000000000002,0.61499999999999999,0.79,0.58599999999999997,0.68,0.57999999999999996,0.71799999999999997,0.54,0.62,0.54,0.63900000000000001,0.49,0.62,0.54,0.63900000000000001,0.49,0.63400000000000001,0.59599999999999997,0.63900000000000001,0.45,0.63400000000000001,0.59599999999999997,0.63900000000000001,0.45,0.57599999999999996,0.54900000000000004,0.6,0.4,0.57599999999999996,0.54900000000000004,0.6,0.4,0.56999999999999995,0.53900000000000003,0.59,0.4]
[2016,10.1,13.7,1.1881188118811881,0.87591240875912413,9.6999999999999993,15.8,1.2371134020618557,0.75949367088607589,10.1,14,1.1881188118811881,0.8571428571428571,9.6999999999999993,16.100000000000001,1.2371134020618557,0.74534161490683226,10.1,13.7,1.1881188118811881,0.87591240875912413,9.6999999999999993,15.8,1.2371134020618557,0.75949367088607589,9.5619999999999994,12.5,1.2549675800041833,0.96,9.6999999999999993,16.100000000000001,1.2371134020618557,0.74534161490683226,0.75,0.6,0.78,0.5,0.72,0.56000000000000005,0.75,0.49,0.66,0.54,0.68,0.44,0.61,0.52,0.625,0.41,0.56000000000000005,0.5,0.58499999999999996,0.38,0.61,0.55000000000000004,0.69499999999999995,0.44,0.61,0.55000000000000004,0.63500000000000001,0.4,0.56000000000000005,0.52,0.59499999999999997,0.39,0.56000000000000005,0.52,0.59499999999999997,0.39,0.56000000000000005,0.5,0.58499999999999996,0.38]
[2017,10.1,13.7,1.1881188118811881,0.87591240875912413,9.6999999999999993,15.8,1.2371134020618557,0.75949367088607589,10.1,14,1.1881188118811881,0.8571428571428571,9.6999999999999993,16.100000000000001,1.2371134020618557,0.74534161490683226,10.1,13.7,1.1881188118811881,0.87591240875912413,9.6999999999999993,15.8,1.2371134020618557,0.75949367088607589,9.5619999999999994,12.5,1.2549675800041833,0.96,9.6999999999999993,16.100000000000001,1.2371134020618557,0.74534161490683226,0.75,0.6,0.78,0.5,0.72,0.56000000000000005,0.75,0.49,0.66,0.54,0.68,0.44,0.61,0.52,0.625,0.41,0.56000000000000005,0.5,0.58499999999999996,0.38,0.61,0.55000000000000004,0.69499999999999995,0.44,0.61,0.55000000000000004,0.63500000000000001,0.4,0.56000000000000005,0.52,0.59499999999999997,0.39,0.56000000000000005,0.52,0.59499999999999997,0.39,0.56000000000000005,0.5,0.58499999999999996,0.38]
[2018,10.1,13.7,1.1881188118811881,0.87591240875912413,9.6999999999999993,15.8,1.2371134020618557,0.75949367088607589,10.1,14,1.1881188118811881,0.8571428571428571,9.6999999999999993,16.100000000000001,1.2371134020618557,0.74534161490683226,10.1,13.7,1.1881188118811881,0.87591240875912413,9.6999999999999993,15.8,1.2371134020618557,0.75949367088607589,10.1,14,1.1881188118811881,0.8571428571428571,9.6999999999999993,16.100000000000001,1.2371134020618557,0.74534161490683226,0.75,0.6,0.78,0.5,0.72,0.56000000000000005,0.75,0.49,0.66,0.54,0.68,0.44,0.61,0.52,0.625,0.41,0.56000000000000005,0.5,0.58499999999999996,0.38,0.61,0.55000000000000004,0.69499999999999995,0.44,0.61,0.55000000000000004,0.63500000000000001,0.4,0.56000000000000005,0.52,0.59499999999999997,0.39,0.56000000000000005,0.52,0.59499999999999997,0.39,0.56000000000000005,0.5,0.58499999999999996,0.38]
["ARTRM8",9.5619999999999994,12.5,1.2549675800041833,0.96,9.5619999999999994,12.5,1.2549675800041833,0.96,9.5619999999999994,12.75,1.2549675800041833,0.94117647058823528,9.5619999999999994,12.75,1.2549675800041833,0.94117647058823528,9.5619999999999994,12.5,1.2549675800041833,0.96,9.5619999999999994,12.5,1.2549675800041833,0.96,9.5619999999999994,12.75,1.2549675800041833,0.94117647058823528,9.5619999999999994,12.75,1.2549675800041833,0.94117647058823528,0.78,0.63,0.8,0.6,0.77500000000000002,0.61499999999999999,0.79,0.58599999999999997,0.68,0.57999999999999996,0.71799999999999997,0.54,0.62,0.54,0.63900000000000001,0.49,0.62,0.54,0.63900000000000001,0.49,0.63400000000000001,0.59599999999999997,0.63900000000000001,0.45,0.63400000000000001,0.59599999999999997,0.63900000000000001,0.45,0.57599999999999996,0.54900000000000004,0.6,0.4,0.57599999999999996,0.54900000000000004,0.6,0.4,0.56999999999999995,0.53900000000000003,0.59,0.4]
["CPS",10.1,13.7,1.1881188118811881,0.87591240875912413,9.6999999999999993,15.8,1.2371134020618557,0.75949367088607589,10.1,14,1.1881188118811881,0.8571428571428571,9.6999999999999993,16.100000000000001,1.2371134020618557,0.74534161490683226,10.1,13.7,1.1881188118811881,0.87591240875912413,9.6999999999999993,15.8,1.2371134020618557,0.75949367088607589,10.1,14,1.1881188118811881,0.8571428571428571,9.6999999999999993,16.100000000000001,1.2371134020618557,0.74534161490683226,0.75,0.6,0.78,0.5,0.72,0.56000000000000005,0.75,0.49,0.66,0.54,0.68,0.44,0.61,0.52,0.625,0.41,0.56000000000000005,0.5,0.58499999999999996,0.38,0.61,0.55000000000000004,0.69499999999999995,0.44,0.61,0.55000000000000004,0.63500000000000001,0.4,0.56000000000000005,0.52,0.59499999999999997,0.39,0.56000000000000005,0.5,0.58499999999999996,0.38,0.56000000000000005,0.5,0.58499999999999996,0.38]

{"sheet":"PTAC","index":10,"n_rows":40,"n_cols":46,"rows_kept":40,"cut":false,"hidden":true,"merged":[[7,20,7,21],[7,12,7,13],[7,14,7,15],[7,8,8,8],[9,0,37,0],[7,0,8,1],[7,10,7,11],[7,16,7,17],[7,18,7,19]]}
[null,null,"PackagedTerminalAirConditioner","PackagedTerminalHeatPump","PackagedTerminalHeatPump","PackagedTerminalAirConditioner","PackagedTerminalHeatPump","PackagedTerminalHeatPump"]
[null,null,"StandardSize","StandardSize","StandardSize","NonStandardSize","NonStandardSize","NonStandardSize"]
[]
[]
[null,null,{"$f":"C1&C2&C3&C4","v":"PackagedTerminalAirConditionerStandardSize"},{"$f":"D1&D2&D3&D4","v":"PackagedTerminalHeatPumpStandardSize"},{"$f":"E1&E2&E3&E4","v":"PackagedTerminalHeatPumpStandardSize"},"PackagedTerminalAirConditionerNonStandardSize","PackagedTerminalHeatPumpNonStandardSize","PackagedTerminalHeatPumpNonStandardSize"]
[null,null,null,null,null,null,null,null,null,null,null,null,null,null,null,null,null,null,null,null,null,null,null,null,null,null,null,null,"Standard Size",null,null,null,null,null,null,null,null,"Non-Standard Size"]
[null,null,null,null,null,null,null,null,null,null,"Standard Size",null,null,null,null,null,"Non-Standard Size"]
["Manuf. Year",null,"Air Conditioners - Cooling Mode","Heat Pumps - Cooling Mode","Heat Pumps - Heating Mode","Air Conditioners - Cooling Mode","Heat Pumps - Cooling Mode","Heat Pumps - Heating Mode","Applicable Standard",null,"PTAC Cooling\nEER",null,"PTHP Cooling\nEER",null,"PTHP Heating\nCOP",null,"PTAC Cooling\nEER",null,"PTHP Cooling\nEER",null,"PTHP Heating\nCOP",null,null,"No.","Btuh","Btuh Ajdustment*","Manuf.\nYr","Row ID","PTAC Cooling\nER","PTAC Cooling\nIECC2009","PTAC Cooling\nIECC2015","PTHP Cooling ER","PTHP Cooling\nIECC2009","PTHP Cooling\nIECC2015","PTHP Heating ER","PTHP Heating\nIECC2009","PTHP Heating\nIECC2015","PTAC Cooling\nER","PTAC Cooling\nIECC2009","PTAC Cooling\nIECC2015","PTHP Cooling ER","PTHP Cooling\nIECC2009","PTHP Cooling\nIECC2015","PTHP Heating ER","PTHP Heating\nIECC2009","PTHP Heating\nIECC2015"]
[null,null,"EER","EER","COP","EER","EER","COP",null,null,"a","b","a","b","a","b","a","b","a","b","a","b",null,null,null,null,null,null,"ER","ARTRM8","CPS","ER","ARTRM8","CPS","ER","ARTRM8","CPS","ER","ARTRM8","CPS","ER","ARTRM8","CPS","ER","ARTRM8","CPS"]
["BASELINE EFFICIENCIES",1990,"12.5-(0.213* CAP/1000)","12.3-(0.213* CAP/1000)","3.2-(0.026* CAP/1000)","10.9-(0.213 * CAP/1000)","10.8-(0.213 * CAP/1000)","2.9-(0.026* CAP/1000)","ASHRAE 90.1--1989",null,12.5,0.21299999999999999,12.3,0.21299999999999999,3.2,2.5999999999999999E-2,10.9,0.21299999999999999,10.8,0.21299999999999999,2.9,2.5999999999999999E-2,null,1,{"$f":"Inventory!BN8*12000","v":0},{"$f":"IF($Y10<0,0,IF($Y10<(7000),(7000),IF($Y10>(15000),(15000),$Y10)))","v":7000},{"$f":"IF(Inventory!BK8<1990,1990,Inventory!BK8)","v":1990},{"$f":"MATCH($AA10,BaselineRow,0)","v":1},{"$f":"12/ROUND((INDEX(PTACStandardCoolingEER,$AB10,1)-(INDEX(PTACStandardCoolingEER,$AB10,2)*($Z10/1000))),1)","v":1.0909090909090908},{"$f":"12/ROUND((K$39-(L$39*($Z10/1000))),1)","v":1.0256410256410258},{"$f":"12/ROUND((K$40-(L$40*($Z10/1000))),1)","v":1.0084033613445378},{"$f":"12/ROUND((INDEX(PTHPStandardCoolingEER,$AB10,1)-(INDEX(PTHPStandardCoolingEER,$AB10,2)*($Z10/1000))),1)","v":1.1111111111111109},{"$f":"12/ROUND(M$39-(N$39*($Z10/1000)),1)","v":1.0084033613445378},{"$f":"12/ROUND(M$40-(N$40*($Z10/1000)),1)","v":1.0084033613445378},{"$f":"12/3.412/ROUND((INDEX(PTHPStandardHeatingCOP,$AB10,1)-(INDEX(PTHPStandardHeatingCOP,$AB10,2)*($Z10/1000))),1)","v":1.1723329425556859},{"$f":"12/3.412/(O$39-(P$39*($Z10/1000)))","v":1.0542562433054727},{"$f":"12/3.412/(O$40-(P$40*($Z10/1000)))","v":1.16534089717265},{"$f":"12/ROUND((INDEX(PTACNonStandardCoolingEER,$AB10,1)-(INDEX(PTACNonStandardCoolingEER,$AB10,2)*($Z10/1000))),1)","v":1.2765957446808509},{"$f":"12/ROUND((Q$39-(R$39*($Z10/1000))),1)","v":1.2765957446808509},{"$f":"12/ROUND((Q$40-(R$40*($Z10/1000))),1)","v":1.2765957446808509},{"$f":"12/ROUND((INDEX(PTHPNonStandardCoolingEER,$AB10,1)-(INDEX(PTHPNonStandardCoolingEER,$AB10,2)*($Z10/1000))),1)","v":1.2903225806451613},{"$f":"12/ROUND(S$39-(T$39*($Z10/1000)),1)","v":1.2903225806451613},{"$f":"12/ROUND(S$40-(T$40*($Z10/1000)),1)","v":1.2903225806451613},{"$f":"12/3.412/(INDEX(PTHPNonStandardHeatingCOP,$AB10,1)-(INDEX(PTHPNonStandardHeatingCOP,$AB10,2)*($Z10/1000)))","v":1.2939657202601389},{"$f":"12/3.412/(U$39-(V$39*($Z10/1000)))","v":1.2939657202601389},{"$f":"12/3.412/(U$40-(V$40*($Z10/1000)))","v":1.2939657202601389}]
[null,1991,"12.5-(0.213* CAP/1000)","12.3-(0.213* CAP/1000)","3.2-(0.026* CAP/1000)","10.9-(0.213 * CAP/1000)","10.8-(0.213 * CAP/1000)","2.9-(0.026* CAP/1000)","ASHRAE 90.1--1989",null,12.5,0.21299999999999999,12.3,0.21299999999999999,3.2,2.5999999999999999E-2,10.9,0.21299999999999999,10.8,0.21299999999999999,2.9,2.5999999999999999E-2,null,2,{"$f":"Inventory!BN9*12000","v":0},{"$f":"IF($Y11<0,0,IF($Y11<(7000),(7000),IF($Y11>(15000),(15000),$Y11)))","v":7000},{"$f":"IF(Inventory!BK9<1990,1990,Inventory!BK9)","v":1990},{"$f":"MATCH($AA11,BaselineRow,0)","v":1},1.0909090909090908,1.0256410256410258,1.0084033613445378,1.1111111111111109,1.0084033613445378,1.0084033613445378,{"$f":"12/3.412/(INDEX(PTHPStandardHeatingCOP,$AB11,1)-(INDEX(PTHPStandardHeatingCOP,$AB11,2)*($Z11/1000)))","v":1.16534089717265},1.0542562433054727,1.16534089717265,1.2765957446808509,1.2765957446808509,1.2765957446808509,1.2903225806451613,1.2903225806451613,1.2903225806451613,1.2939657202601389,1.2939657202601389,1.2939657202601389]
[null,1992,"12.5-(0.213* CAP/1000)","12.3-(0.213* CAP/1000)","3.2-(0.026* CAP/1000)","10.9-(0.213 * CAP/1000)","10.8-(0.213 * CAP/1000)","2.9-(0.026* CAP/1000)","ASHRAE 90.1--1989",null,12.5,0.21299999999999999,12.3,0.21299999999999999,3.2,2.5999999999999999E-2,10.9,0.21299999999999999,10.8,0.21299999999999999,2.9,2.5999999999999999E-2,null,3,{"$f":"Inventory!BN10*12000","v":0},7000,{"$f":"IF(Inventory!BK10<1990,1990,Inventory!BK10)","v":1990},1,1.0909090909090908,1.0256410256410258,1.0084033613445378,1.1111111111111109,1.0084033613445378,1.0084033613445378,1.16534089717265,1.0542562433054727,1.16534089717265,1.2765957446808509,1.2765957446808509,1.2765957446808509,1.2903225806451613,1.2903225806451613,1.2903225806451613,1.2939657202601389,1.2939657202601389,1.2939657202601389]
[null,1993,"12.5-(0.213* CAP/1000)","12.3-(0.213* CAP/1000)","3.2-(0.026* CAP/1000)","10.9-(0.213 * CAP/1000)","10.8-(0.213 * CAP/1000)","2.9-(0.026* CAP/1000)","ASHRAE 90.1--1989",null,12.5,0.21299999999999999,12.3,0.21299999999999999,3.2,2.5999999999999999E-2,10.9,0.21299999999999999,10.8,0.21299999999999999,2.9,2.5999999999999999E-2,null,4,{"$f":"Inventory!BN11*12000","v":0},7000,{"$f":"IF(Inventory!BK11<1990,1990,Inventory!BK11)","v":1990},1,1.0909090909090908,1.0256410256410258,1.0084033613445378,1.1111111111111109,1.0084033613445378,1.0084033613445378,1.16534089717265,1.0542562433054727,1.16534089717265,1.2765957446808509,1.2765957446808509,1.2765957446808509,1.2903225806451613,1.2903225806451613,1.2903225806451613,1.2939657202601389,1.2939657202601389,1.2939657202601389]
[null,1994,"12.5-(0.213* CAP/1000)","12.3-(0.213* CAP/1000)","3.2-(0.026* CAP/1000)","10.9-(0.213 * CAP/1000)","10.8-(0.213 * CAP/1000)","2.9-(0.026* CAP/1000)","ASHRAE 90.1--1989",null,12.5,0.21299999999999999,12.3,0.21299999999999999,3.2,2.5999999999999999E-2,10.9,0.21299999999999999,10.8,0.21299999999999999,2.9,2.5999999999999999E-2,null,5,{"$f":"Inventory!BN12*12000","v":0},7000,{"$f":"IF(Inventory!BK12<1990,1990,Inventory!BK12)","v":1990},1,1.0909090909090908,1.0256410256410258,1.0084033613445378,1.1111111111111109,1.0084033613445378,1.0084033613445378,1.16534089717265,1.0542562433054727,1.16534089717265,1.2765957446808509,1.2765957446808509,1.2765957446808509,1.2903225806451613,1.2903225806451613,1.2903225806451613,1.2939657202601389,1.2939657202601389,1.2939657202601389]
[null,1995,"12.5-(0.213* CAP/1000)","12.3-(0.213* CAP/1000)","3.2-(0.026* CAP/1000)","10.9-(0.213 * CAP/1000)","10.8-(0.213 * CAP/1000)","2.9-(0.026* CAP/1000)","ASHRAE 90.1--1989",null,12.5,0.21299999999999999,12.3,0.21299999999999999,3.2,2.5999999999999999E-2,10.9,0.21299999999999999,10.8,0.21299999999999999,2.9,2.5999999999999999E-2,null,6,{"$f":"Inventory!BN13*12000","v":0},7000,{"$f":"IF(Inventory!BK13<1990,1990,Inventory!BK13)","v":1990},1,1.0909090909090908,1.0256410256410258,1.0084033613445378,1.1111111111111109,1.0084033613445378,1.0084033613445378,1.16534089717265,1.0542562433054727,1.16534089717265,1.2765957446808509,1.2765957446808509,1.2765957446808509,1.2903225806451613,1.2903225806451613,1.2903225806451613,1.2939657202601389,1.2939657202601389,1.2939657202601389]
[null,1996,"12.5-(0.213* CAP/1000)","12.3-(0.213* CAP/1000)","3.2-(0.026* CAP/1000)","10.9-(0.213 * CAP/1000)","10.8-(0.213 * CAP/1000)","2.9-(0.026* CAP/1000)","ASHRAE 90.1--1989",null,12.5,0.21299999999999999,12.3,0.21299999999999999,3.2,2.5999999999999999E-2,10.9,0.21299999999999999,10.8,0.21299999999999999,2.9,2.5999999999999999E-2,null,7,{"$f":"Inventory!BN14*12000","v":0},7000,{"$f":"IF(Inventory!BK14<1990,1990,Inventory!BK14)","v":1990},1,1.0909090909090908,1.0256410256410258,1.0084033613445378,1.1111111111111109,1.0084033613445378,1.0084033613445378,1.16534089717265,1.0542562433054727,1.16534089717265,1.2765957446808509,1.2765957446808509,1.2765957446808509,1.2903225806451613,1.2903225806451613,1.2903225806451613,1.2939657202601389,1.2939657202601389,1.2939657202601389]
[null,1997,"12.5-(0.213* CAP/1000)","12.3-(0.213* CAP/1000)","3.2-(0.026* CAP/1000)","10.9-(0.213 * CAP/1000)","10.8-(0.213 * CAP/1000)","2.9-(0.026* CAP/1000)","ASHRAE 90.1--1989",null,12.5,0.21299999999999999,12.3,0.21299999999999999,3.2,2.5999999999999999E-2,10.9,0.21299999999999999,10.8,0.21299999999999999,2.9,2.5999999999999999E-2,null,8,{"$f":"Inventory!BN15*12000","v":0},7000,{"$f":"IF(Inventory!BK15<1990,1990,Inventory!BK15)","v":1990},1,1.0909090909090908,1.0256410256410258,1.0084033613445378,1.1111111111111109,1.0084033613445378,1.0084033613445378,1.16534089717265,1.0542562433054727,1.16534089717265,1.2765957446808509,1.2765957446808509,1.2765957446808509,1.2903225806451613,1.2903225806451613,1.2903225806451613,1.2939657202601389,1.2939657202601389,1.2939657202601389]
[null,1998,"12.5-(0.213* CAP/1000)","12.3-(0.213* CAP/1000)","3.2-(0.026* CAP/1000)","10.9-(0.213 * CAP/1000)","10.8-(0.213 * CAP/1000)","2.9-(0.026* CAP/1000)","ASHRAE 90.1--1989",null,12.5,0.21299999999999999,12.3,0.21299999999999999,3.2,2.5999999999999999E-2,10.9,0.21299999999999999,10.8,0.21299999999999999,2.9,2.5999999999999999E-2,null,9,{"$f":"Inventory!BN16*12000","v":0},7000,{"$f":"IF(Inventory!BK16<1990,1990,Inventory!BK16)","v":1990},1,1.0909090909090908,1.0256410256410258,1.0084033613445378,1.1111111111111109,1.0084033613445378,1.0084033613445378,1.16534089717265,1.0542562433054727,1.16534089717265,1.2765957446808509,1.2765957446808509,1.2765957446808509,1.2903225806451613,1.2903225806451613,1.2903225806451613,1.2939657202601389,1.2939657202601389,1.2939657202601389]
[null,1999,"12.5-(0.213* CAP/1000)","12.3-(0.213* CAP/1000)","3.2-(0.026* CAP/1000)","10.9-(0.213 * CAP/1000)","10.8-(0.213 * CAP/1000)","2.9-(0.026* CAP/1000)","ASHRAE 90.1--1999",null,12.5,0.21299999999999999,12.3,0.21299999999999999,3.2,2.5999999999999999E-2,10.9,0.21299999999999999,10.8,0.21299999999999999,2.9,2.5999999999999999E-2,null,10,{"$f":"Inventory!BN17*12000","v":0},7000,{"$f":"IF(Inventory!BK17<1990,1990,Inventory!BK17)","v":1990},1,1.0909090909090908,1.0256410256410258,1.0084033613445378,1.1111111111111109,1.0084033613445378,1.0084033613445378,1.16534089717265,1.0542562433054727,1.16534089717265,1.2765957446808509,1.2765957446808509,1.2765957446808509,1.2903225806451613,1.2903225806451613,1.2903225806451613,1.2939657202601389,1.2939657202601389,1.2939657202601389]
[null,2000,"12.5-(0.213* CAP/1000)","12.3-(0.213* CAP/1000)","3.2-(0.026* CAP/1000)","10.9-(0.213 * CAP/1000)","10.8-(0.213 * CAP/1000)","2.9-(0.026* CAP/1000)","ASHRAE 90.1--1999",null,12.5,0.21299999999999999,12.3,0.21299999999999999,3.2,2.5999999999999999E-2,10.9,0.21299999999999999,10.8,0.21299999999999999,2.9,2.5999999999999999E-2,null,11,{"$f":"Inventory!BN18*12000","v":0},7000,{"$f":"IF(Inventory!BK18<1990,1990,Inventory!BK18)","v":1990},1,1.0909090909090908,1.0256410256410258,1.0084033613445378,1.1111111111111109,1.0084033613445378,1.0084033613445378,1.16534089717265,1.0542562433054727,1.16534089717265,1.2765957446808509,1.2765957446808509,1.2765957446808509,1.2903225806451613,1.2903225806451613,1.2903225806451613,1.2939657202601389,1.2939657202601389,1.2939657202601389]
[null,2001,"12.5-(0.213* CAP/1000)","12.3-(0.213* CAP/1000)","3.2-(0.026* CAP/1000)","10.9-(0.213 * CAP/1000)","10.8-(0.213 * CAP/1000)","2.9-(0.026* CAP/1000)","ASHRAE 90.1--1999 ",null,12.5,0.21299999999999999,12.3,0.21299999999999999,3.2,2.5999999999999999E-2,10.9,0.21299999999999999,10.8,0.21299999999999999,2.9,2.5999999999999999E-2,null,12,{"$f":"Inventory!BN19*12000","v":0},7000,{"$f":"IF(Inventory!BK19<1990,1990,Inventory!BK19)","v":1990},1,1.0909090909090908,1.0256410256410258,1.0084033613445378,1.1111111111111109,1.0084033613445378,1.0084033613445378,1.16534089717265,1.0542562433054727,1.16534089717265,1.2765957446808509,1.2765957446808509,1.2765957446808509,1.2903225806451613,1.2903225806451613,1.2903225806451613,1.2939657202601389,1.2939657202601389,1.2939657202601389]
[null,2002,"12.5-(0.213* CAP/1000)","12.3-(0.213* CAP/1000)","3.2-(0.026* CAP/1000)","10.9-(0.213 * CAP/1000)","10.8-(0.213 * CAP/1000)","2.9-(0.026* CAP/1000)","ASHRAE 90.1--1999 (as of 10/29/2001)",null,12.5,0.21299999999999999,12.3,0.21299999999999999,3.2,2.5999999999999999E-2,10.9,0.21299999999999999,10.8,0.21299999999999999,2.9,2.5999999999999999E-2,null,13,{"$f":"Inventory!BN20*12000","v":0},7000,{"$f":"IF(Inventory!BK20<1990,1990,Inventory!BK20)","v":1990},1,1.0909090909090908,1.0256410256410258,1.0084033613445378,1.1111111111111109,1.0084033613445378,1.0084033613445378,1.16534089717265,1.0542562433054727,1.16534089717265,1.2765957446808509,1.2765957446808509,1.2765957446808509,1.2903225806451613,1.2903225806451613,1.2903225806451613,1.2939657202601389,1.2939657202601389,1.2939657202601389]
[null,2003,"12.5-(0.213* CAP/1000)","12.3-(0.213* CAP/1000)","3.2-(0.026* CAP/1000)","10.9-(0.213 * CAP/1000)","10.8-(0.213 * CAP/1000)","2.9-(0.026* CAP/1000)","ASHRAE 90.1--1999 (as of 10/29/2001)",null,12.5,0.21299999999999999,12.3,0.21299999999999999,3.2,2.5999999999999999E-2,10.9,0.21299999999999999,10.8,0.21299999999999999,2.9,2.5999999999999999E-2,null,14,{"$f":"Inventory!BN21*12000","v":0},7000,{"$f":"IF(Inventory!BK21<1990,1990,Inventory!BK21)","v":1990},1,1.0909090909090908,1.0256410256410258,1.0084033613445378,1.1111111111111109,1.0084033613445378,1.0084033613445378,1.16534089717265,1.0542562433054727,1.16534089717265,1.2765957446808509,1.2765957446808509,1.2765957446808509,1.2903225806451613,1.2903225806451613,1.2903225806451613,1.2939657202601389,1.2939657202601389,1.2939657202601389]
[null,2004,"12.5-(0.213* CAP/1000)","12.3-(0.213* CAP/1000)","3.2-(0.026* CAP/1000)","10.9-(0.213 * CAP/1000)","10.8-(0.213 * CAP/1000)","2.9-(0.026* CAP/1000)","ASHRAE 90.1--2004",null,12.5,0.21299999999999999,12.3,0.21299999999999999,3.2,2.5999999999999999E-2,10.9,0.21299999999999999,10.8,0.21299999999999999,2.9,2.5999999999999999E-2,null,15,{"$f":"Inventory!BN22*12000","v":0},7000,{"$f":"IF(Inventory!BK22<1990,1990,Inventory!BK22)","v":1990},1,1.0909090909090908,1.0256410256410258,1.0084033613445378,1.1111111111111109,1.0084033613445378,1.0084033613445378,1.16534089717265,1.0542562433054727,1.16534089717265,1.2765957446808509,1.2765957446808509,1.2765957446808509,1.2903225806451613,1.2903225806451613,1.2903225806451613,1.2939657202601389,1.2939657202601389,1.2939657202601389]
[null,2005,"12.5-(0.213* CAP/1000)","12.3-(0.213* CAP/1000)","3.2-(0.026* CAP/1000)","10.9-(0.213 * CAP/1000)","10.8-(0.213 * CAP/1000)","2.9-(0.026* CAP/1000)","ASHRAE 90.1--2004",null,12.5,0.21299999999999999,12.3,0.21299999999999999,3.2,2.5999999999999999E-2,10.9,0.21299999999999999,10.8,0.21299999999999999,2.9,2.5999999999999999E-2,null,16,{"$f":"Inventory!BN23*12000","v":0},7000,{"$f":"IF(Inventory!BK23<1990,1990,Inventory!BK23)","v":1990},1,1.0909090909090908,1.0256410256410258,1.0084033613445378,1.1111111111111109,1.0084033613445378,1.0084033613445378,1.16534089717265,1.0542562433054727,1.16534089717265,1.2765957446808509,1.2765957446808509,1.2765957446808509,1.2903225806451613,1.2903225806451613,1.2903225806451613,1.2939657202601389,1.2939657202601389,1.2939657202601389]
[null,2006,"12.5-(0.213* CAP/1000)","12.3-(0.213* CAP/1000)","3.2-(0.026* CAP/1000)","10.9-(0.213 * CAP/1000)","10.8-(0.213 * CAP/1000)","2.9-(0.026* CAP/1000)","Federal Standard/ASHRAE 90.1--2004",null,12.5,0.21299999999999999,12.3,0.21299999999999999,3.2,2.5999999999999999E-2,10.9,0.21299999999999999,10.8,0.21299999999999999,2.9,2.5999999999999999E-2,null,17,{"$f":"Inventory!BN24*12000","v":0},7000,{"$f":"IF(Inventory!BK24<1990,1990,Inventory!BK24)","v":1990},1,1.0909090909090908,1.0256410256410258,1.0084033613445378,1.1111111111111109,1.0084033613445378,1.0084033613445378,1.16534089717265,1.0542562433054727,1.16534089717265,1.2765957446808509,1.2765957446808509,1.2765957446808509,1.2903225806451613,1.2903225806451613,1.2903225806451613,1.2939657202601389,1.2939657202601389,1.2939657202601389]
[null,2007,"12.5-(0.213* CAP/1000)","12.3-(0.213* CAP/1000)","3.2-(0.026* CAP/1000)","10.9-(0.213 * CAP/1000)","10.8-(0.213 * CAP/1000)","2.9-(0.026* CAP/1000)","Federal Standard/ASHRAE 90.1-2007 ",null,12.5,0.21299999999999999,12.3,0.21299999999999999,3.2,2.5999999999999999E-2,10.9,0.21299999999999999,10.8,0.21299999999999999,2.9,2.5999999999999999E-2,null,18,{"$f":"Inventory!BN25*12000","v":0},7000,{"$f":"IF(Inventory!BK25<1990,1990,Inventory!BK25)","v":1990},1,1.0909090909090908,1.0256410256410258,1.0084033613445378,1.1111111111111109,1.0084033613445378,1.0084033613445378,1.16534089717265,1.0542562433054727,1.16534089717265,1.2765957446808509,1.2765957446808509,1.2765957446808509,1.2903225806451613,1.2903225806451613,1.2903225806451613,1.2939657202601389,1.2939657202601389,1.2939657202601389]
[null,2008,"12.5-(0.213* CAP/1000)","12.3-(0.213* CAP/1000)","3.2-(0.026* CAP/1000)","10.9-(0.213 * CAP/1000)","10.8-(0.213 * CAP/1000)","2.9-(0.026* CAP/1000)","Federal Standard/ASHRAE 90.1-2007 ",null,12.5,0.21299999999999999,12.3,0.21299999999999999,3.2,2.5999999999999999E-2,10.9,0.21299999999999999,10.8,0.21299999999999999,2.9,2.5999999999999999E-2,null,19,{"$f":"Inventory!BN26*12000","v":0},7000,{"$f":"IF(Inventory!BK26<1990,1990,Inventory!BK26)","v":1990},1,1.0909090909090908,1.0256410256410258,1.0084033613445378,1.1111111111111109,1.0084033613445378,1.0084033613445378,1.16534089717265,1.0542562433054727,1.16534089717265,1.2765957446808509,1.2765957446808509,1.2765957446808509,1.2903225806451613,1.2903225806451613,1.2903225806451613,1.2939657202601389,1.2939657202601389,1.2939657202601389]
[null,2009,"12.5-(0.213* CAP/1000)","12.3-(0.213* CAP/1000)","3.2-(0.026* CAP/1000)","10.9-(0.213 * CAP/1000)","10.8-(0.213 * CAP/1000)","2.9-(0.026* CAP/1000)","Federal Standard/ASHRAE 90.1-2007",null,12.5,0.21299999999999999,12.3,0.21299999999999999,3.2,2.5999999999999999E-2,10.9,0.21299999999999999,10.8,0.21299999999999999,2.9,2.5999999999999999E-2,null,20,{"$f":"Inventory!BN27*12000","v":0},7000,{"$f":"IF(Inventory!BK27<1990,1990,Inventory!BK27)","v":1990},1,1.0909090909090908,1.0256410256410258,1.0084033613445378,1.1111111111111109,1.0084033613445378,1.0084033613445378,1.16534089717265,1.0542562433054727,1.16534089717265,1.2765957446808509,1.2765957446808509,1.2765957446808509,1.2903225806451613,1.2903225806451613,1.2903225806451613,1.2939657202601389,1.2939657202601389,1.2939657202601389]
[null,2010,"12.5-(0.213* CAP/1000)","12.3-(0.213* CAP/1000)","3.2-(0.026* CAP/1000)","10.9-(0.213 * CAP/1000)","10.8-(0.213 * CAP/1000)","2.9-(0.026* CAP/1000)","Federal Standard/ASHRAE 90.1-2007 (as of 1/1/2010)",null,12.5,0.21299999999999999,12.3,0.21299999999999999,3.2,2.5999999999999999E-2,10.9,0.21299999999999999,10.8,0.21299999999999999,2.9,2.5999999999999999E-2,null,21,{"$f":"Inventory!BN28*12000","v":0},7000,{"$f":"IF(Inventory!BK28<1990,1990,Inventory!BK28)","v":1990},1,1.0909090909090908,1.0256410256410258,1.0084033613445378,1.1111111111111109,1.0084033613445378,1.0084033613445378,1.16534089717265,1.0542562433054727,1.16534089717265,1.2765957446808509,1.2765957446808509,1.2765957446808509,1.2903225806451613,1.2903225806451613,1.2903225806451613,1.2939657202601389,1.2939657202601389,1.2939657202601389]
[null,2011,"12.5-(0.213* CAP/1000)","12.3-(0.213* CAP/1000)","3.2-(0.026* CAP/1000)","10.9-(0.213 * CAP/1000)","10.8-(0.213 * CAP/1000)","2.9-(0.026* CAP/1000)","Federal Standard/ASHRAE 90.1-2007 (as of 1/1/2010)",null,12.5,0.21299999999999999,12.3,0.21299999999999999,3.2,2.5999999999999999E-2,10.9,0.21299999999999999,10.8,0.21299999999999999,2.9,2.5999999999999999E-2,null,22,{"$f":"Inventory!BN29*12000","v":0},7000,{"$f":"IF(Inventory!BK29<1990,1990,Inventory!BK29)","v":1990},1,1.0909090909090908,1.0256410256410258,1.0084033613445378,1.1111111111111109,1.0084033613445378,1.0084033613445378,1.16534089717265,1.0542562433054727,1.16534089717265,1.2765957446808509,1.2765957446808509,1.2765957446808509,1.2903225806451613,1.2903225806451613,1.2903225806451613,1.2939657202601389,1.2939657202601389,1.2939657202601389]
[null,2012,"12.5-(0.213* CAP/1000)","12.3-(0.213* CAP/1000)","3.2-(0.026* CAP/1000)","10.9-(0.213 * CAP/1000)","10.8-(0.213 * CAP/1000)","2.9-(0.026* CAP/1000)","Federal Standard/ASHRAE 90.1-2007 (as of 1/1/2010)",null,12.5,0.21299999999999999,12.3,0.21299999999999999,3.2,2.5999999999999999E-2,10.9,0.21299999999999999,10.8,0.21299999999999999,2.9,2.5999999999999999E-2,null,23,{"$f":"Inventory!BN30*12000","v":0},7000,{"$f":"IF(Inventory!BK30<1990,1990,Inventory!BK30)","v":1990},1,1.0909090909090908,1.0256410256410258,1.0084033613445378,1.1111111111111109,1.0084033613445378,1.0084033613445378,1.16534089717265,1.0542562433054727,1.16534089717265,1.2765957446808509,1.2765957446808509,1.2765957446808509,1.2903225806451613,1.2903225806451613,1.2903225806451613,1.2939657202601389,1.2939657202601389,1.2939657202601389]
[null,2013,"12.5-(0.213* CAP/1000)","12.3-(0.213* CAP/1000)","3.2-(0.026* CAP/1000)","10.9-(0.213 * CAP/1000)","10.8-(0.213 * CAP/1000)","2.9-(0.026* CAP/1000)","Federal Standard/ASHRAE 90.1-2007 (as of 1/1/2010)",null,12.5,0.21299999999999999,12.3,0.21299999999999999,3.2,2.5999999999999999E-2,10.9,0.21299999999999999,10.8,0.21299999999999999,2.9,2.5999999999999999E-2,null,24,{"$f":"Inventory!BN31*12000","v":0},7000,{"$f":"IF(Inventory!BK31<1990,1990,Inventory!BK31)","v":1990},1,1.0909090909090908,1.0256410256410258,1.0084033613445378,1.1111111111111109,1.0084033613445378,1.0084033613445378,1.16534089717265,1.0542562433054727,1.16534089717265,1.2765957446808509,1.2765957446808509,1.2765957446808509,1.2903225806451613,1.2903225806451613,1.2903225806451613,1.2939657202601389,1.2939657202601389,1.2939657202601389]
[null,2014,"12.5-(0.213* CAP/1000)","12.3-(0.213* CAP/1000)","3.2-(0.026* CAP/1000)","10.9-(0.213 * CAP/1000)","10.8-(0.213 * CAP/1000)","2.9-(0.026* CAP/1000)","Federal Standard/ASHRAE 90.1-2007 (as of 1/1/2010)",null,12.5,0.21299999999999999,12.3,0.21299999999999999,3.2,2.5999999999999999E-2,10.9,0.21299999999999999,10.8,0.21299999999999999,2.9,2.5999999999999999E-2,null,25,{"$f":"Inventory!BN32*12000","v":0},7000,{"$f":"IF(Inventory!BK32<1990,1990,Inventory!BK32)","v":1990},1,1.0909090909090908,1.0256410256410258,1.0084033613445378,1.1111111111111109,1.0084033613445378,1.0084033613445378,1.16534089717265,1.0542562433054727,1.16534089717265,1.2765957446808509,1.2765957446808509,1.2765957446808509,1.2903225806451613,1.2903225806451613,1.2903225806451613,1.2939657202601389,1.2939657202601389,1.2939657202601389]
[null,2015,"12.5-(0.213* CAP/1000)","12.3-(0.213* CAP/1000)","3.2-(0.026* CAP/1000)","10.9-(0.213 * CAP/1000)","10.8-(0.213 * CAP/1000)","2.9-(0.026* CAP/1000)","Federal Standard/ASHRAE 90.1-2007 (as of 1/1/2010)",null,12.5,0.21299999999999999,12.3,0.21299999999999999,3.2,2.5999999999999999E-2,10.9,0.21299999999999999,10.8,0.21299999999999999,2.9,2.5999999999999999E-2]
[null,2016,"12.5-(0.213* CAP/1000)","12.3-(0.213* CAP/1000)","3.2-(0.026* CAP/1000)","10.9-(0.213 * CAP/1000)","10.8-(0.213 * CAP/1000)","2.9-(0.026* CAP/1000)","Federal Standard/ASHRAE 90.1-2007 (as of 1/1/2010)",null,12.5,0.21299999999999999,12.3,0.21299999999999999,3.2,2.5999999999999999E-2,10.9,0.21299999999999999,10.8,0.21299999999999999,2.9,2.5999999999999999E-2]
[null,2017,"12.5-(0.213* CAP/1000)","12.3-(0.213* CAP/1000)","3.2-(0.026* CAP/1000)","10.9-(0.213 * CAP/1000)","10.8-(0.213 * CAP/1000)","2.9-(0.026* CAP/1000)","Federal Standard/ASHRAE 90.1-2007 (as of 1/1/2010)",null,12.5,0.21299999999999999,12.3,0.21299999999999999,3.2,2.5999999999999999E-2,10.9,0.21299999999999999,10.8,0.21299999999999999,2.9,2.5999999999999999E-2,null,"* CAP = Capacity in Btu/h.  If less than 7,000, use 7,000 for calculations. If more than15,000, use 15,000 for calculations."]
[null,2018,"12.5-(0.213* CAP/1000)","12.3-(0.213* CAP/1000)","3.2-(0.026* CAP/1000)","10.9-(0.213 * CAP/1000)","10.8-(0.213 * CAP/1000)","2.9-(0.026* CAP/1000)","Federal Standard/ASHRAE 90.1-2007 (as of 1/1/2010)",null,12.5,0.21299999999999999,12.3,0.21299999999999999,3.2,2.5999999999999999E-2,10.9,0.21299999999999999,10.8,0.21299999999999999,2.9,2.5999999999999999E-2]
[null,"ARTRM8","13.8-(0.3* CAP/1000)","14-(0.3* CAP/1000)","3.7-(0.052* CAP/1000)","10.9-(0.213 * CAP/1000)","10.8-(0.213 * CAP/1000)","2.9-(0.026* CAP/1000)","Federal Standard/ASHRAE 90.1-2007 (as of 1/1/2010)",null,13.8,0.3,14,0.3,3.7,5.1999999999999998E-2,10.9,0.21299999999999999,10.8,0.21299999999999999,2.9,2.5999999999999999E-2]
[null,"CPS","14-(0.3* CAP/1000)","14-(0.3* CAP/1000)","3.2-(0.026* CAP/1000)","10.9-(0.213 * CAP/1000)","10.8-(0.213 * CAP/1000)","2.9-(0.026* CAP/1000)","ASHRAE 90.1--2010 (as of 10/8/2012)",null,14,0.3,14,0.3,3.2,2.5999999999999999E-2,10.9,0.21299999999999999,10.8,0.21299999999999999,2.9,2.5999999999999999E-2]

{"sheet":"RoomAC","index":11,"n_rows":37,"n_cols":51,"rows_kept":37,"cut":false,"hidden":true,"merged":[]}
[null,"RoomAirConditioner",null,null,"RoomAirConditioner",null,null,"RoomAirConditioner",null,null,"RoomAirConditioner",null,null,"RoomAirConditioner",null,null,"RoomAirConditioner",null,null,"RoomAirConditioner",null,null,"RoomAirConditioner",null,null,"RoomAirConditioner",null,null,"RoomAirConditioner",null,null,"RoomAirConditioner",null,null,"RoomAirConditioner",null,null,"RoomAirConditioner",null,null,"RoomAirConditioner",null,null,"RoomAirConditioner",null,null,"RoomAirConditioner"]
[null,"WithoutReverseCycle",null,null,"WithoutReverseCycle",null,null,"WithoutReverseCycle",null,null,"WithoutReverseCycle",null,null,"WithoutReverseCycle",null,null,"WithoutReverseCycle",null,null,"WithoutReverseCycle",null,null,"WithoutReverseCycle",null,null,"WithoutReverseCycle",null,null,"WithoutReverseCycle",null,null,"WithReverseCycle",null,null,"WithReverseCycle",null,null,"WithReverseCycle",null,null,"WithReverseCycle",null,null,"CasementOnly",null,null,"CasementSlider"]
[null,"WithLouveredSides",null,null,"WithLouveredSides",null,null,"WithLouveredSides",null,null,"WithLouveredSides",null,null,"WithLouveredSides",null,null,"WithoutLouveredSides",null,null,"WithoutLouveredSides",null,null,"WithoutLouveredSides",null,null,"WithoutLouveredSides",null,null,"WithoutLouveredSides",null,null,"WithLouveredSides",null,null,"WithLouveredSides",null,null,"WithoutLouveredSides",null,null,"WithoutLouveredSides"]
[null,"Lessthan8kbtuh",null,null,"8to14kbtuh",null,null,"14to20kbtuh",null,null,"20to25kbtuh",null,null,"Greaterthan25kbtuh",null,null,"Lessthan8kbtuh",null,null,"8to11kbtuh",null,null,"11to14kbtuh",null,null,"14to20kbtuh",null,null,"Greaterthan20kbtuh",null,null,"Lessthan20kbtuh",null,null,"Greaterthan20kbtuh",null,null,"Lessthan14kbtuh",null,null,"Greaterthan14kbtuh",null,null,"All",null,null,"All"]
[null,{"$f":"B1&B2&B3&B4","v":"RoomAirConditionerWithoutReverseCycleWithLouveredSidesLessthan8kbtuh"},null,null,{"$f":"E1&E2&E3&E4","v":"RoomAirConditionerWithoutReverseCycleWithLouveredSides8to14kbtuh"},null,null,{"$f":"H1&H2&H3&H4","v":"RoomAirConditionerWithoutReverseCycleWithLouveredSides14to20kbtuh"},null,null,{"$f":"K1&K2&K3&K4","v":"RoomAirConditionerWithoutReverseCycleWithLouveredSides20to25kbtuh"},null,null,{"$f":"N1&N2&N3&N4","v":"RoomAirConditionerWithoutReverseCycleWithLouveredSidesGreaterthan25kbtuh"},null,null,{"$f":"Q1&Q2&Q3&Q4","v":"RoomAirConditionerWithoutReverseCycleWithoutLouveredSidesLessthan8kbtuh"},null,null,{"$f":"T1&T2&T3&T4","v":"RoomAirConditionerWithoutReverseCycleWithoutLouveredSides8to11kbtuh"},null,null,{"$f":"W1&W2&W3&W4","v":"RoomAirConditionerWithoutReverseCycleWithoutLouveredSides11to14kbtuh"},null,null,{"$f":"Z1&Z2&Z3&Z4","v":"RoomAirConditionerWithoutReverseCycleWithoutLouveredSides14to20kbtuh"},null,null,{"$f":"AC1&AC2&AC3&AC4","v":"RoomAirConditionerWithoutReverseCycleWithoutLouveredSidesGreaterthan20kbtuh"},null,null,{"$f":"AF1&AF2&AF3&AF4","v":"RoomAirConditionerWithReverseCycleWithLouveredSidesLessthan20kbtuh"},null,null,{"$f":"AI1&AI2&AI3&AI4","v":"RoomAirConditionerWithReverseCycleWithLouveredSidesGreaterthan20kbtuh"},null,null,{"$f":"AL1&AL2&AL3&AL4","v":"RoomAirConditionerWithReverseCycleWithoutLouveredSidesLessthan14kbtuh"},null,null,{"$f":"AO1&AO2&AO3&AO4","v":"RoomAirConditionerWithReverseCycleWithoutLouveredSidesGreaterthan14kbtuh"},null,null,{"$f":"AR1&AR2&AR3&AR4","v":"RoomAirConditionerCasementOnlyAll"},null,null,{"$f":"AU1&AU2&AU3&AU4","v":"RoomAirConditionerCasementSliderAll"}]
["Manuf. Year","EER","Full Load","Part Load","EER","Full Load","Part Load","EER","Full Load","Part Load","EER","Full Load","Part Load","EER","Full Load","Part Load","EER","Full Load","Part Load","EER","Full Load","Part Load","EER","Full Load","Part Load","EER","Full Load","Part Load","EER","Full Load","Part Load","EER","Full Load","Part Load","EER","Full Load","Part Load","EER","Full Load","Part Load","EER","Full Load","Part Load","EER","Full Load","Part Load","EER","Full Load","Part Load",null,"Applicable Standard"]
[1990,{"$f":"INDEX(B$36:B$37,MATCH(TRM,$A$36:$A$37,0))","v":{"$error":"#N/A"}},{"$f":"12/B7","v":{"$error":"#N/A"}},{"$f":"C7","v":{"$error":"#N/A"}},{"$f":"INDEX(E$36:E$37,MATCH(TRM,$A$36:$A$37,0))","v":{"$error":"#N/A"}},{"$f":"12/E7","v":{"$error":"#N/A"}},{"$f":"F7","v":{"$error":"#N/A"}},{"$f":"INDEX(H$36:H$37,MATCH(TRM,$A$36:$A$37,0))","v":{"$error":"#N/A"}},{"$f":"12/H7","v":{"$error":"#N/A"}},{"$f":"I7","v":{"$error":"#N/A"}},{"$f":"INDEX(K$36:K$37,MATCH(TRM,$A$36:$A$37,0))","v":{"$error":"#N/A"}},{"$f":"12/K7","v":{"$error":"#N/A"}},{"$f":"L7","v":{"$error":"#N/A"}},{"$f":"INDEX(N$36:N$37,MATCH(TRM,$A$36:$A$37,0))","v":{"$error":"#N/A"}},{"$f":"12/N7","v":{"$error":"#N/A"}},{"$f":"O7","v":{"$error":"#N/A"}},{"$f":"INDEX(Q$36:Q$37,MATCH(TRM,$A$36:$A$37,0))","v":{"$error":"#N/A"}},{"$f":"12/Q7","v":{"$error":"#N/A"}},{"$f":"R7","v":{"$error":"#N/A"}},{"$f":"INDEX(T$36:T$37,MATCH(TRM,$A$36:$A$37,0))","v":{"$error":"#N/A"}},{"$f":"12/T7","v":{"$error":"#N/A"}},{"$f":"U7","v":{"$error":"#N/A"}},{"$f":"INDEX(W$36:W$37,MATCH(TRM,$A$36:$A$37,0))","v":{"$error":"#N/A"}},{"$f":"12/W7","v":{"$error":"#N/A"}},{"$f":"X7","v":{"$error":"#N/A"}},{"$f":"INDEX(Z$36:Z$37,MATCH(TRM,$A$36:$A$37,0))","v":{"$error":"#N/A"}},{"$f":"12/Z7","v":{"$error":"#N/A"}},{"$f":"AA7","v":{"$error":"#N/A"}},{"$f":"INDEX(AC$36:AC$37,MATCH(TRM,$A$36:$A$37,0))","v":{"$error":"#N/A"}},{"$f":"12/AC7","v":{"$error":"#N/A"}},{"$f":"AD7","v":{"$error":"#N/A"}},{"$f":"INDEX(AF$36:AF$37,MATCH(TRM,$A$36:$A$37,0))","v":{"$error":"#N/A"}},{"$f":"12/AF7","v":{"$error":"#N/A"}},{"$f":"AG7","v":{"$error":"#N/A"}},{"$f":"INDEX(AI$36:AI$37,MATCH(TRM,$A$36:$A$37,0))","v":{"$error":"#N/A"}},{"$f":"12/AI7","v":{"$error":"#N/A"}},{"$f":"AJ7","v":{"$error":"#N/A"}},{"$f":"INDEX(AL$36:AL$37,MATCH(TRM,$A$36:$A$37,0))","v":{"$error":"#N/A"}},{"$f":"12/AL7","v":{"$error":"#N/A"}},{"$f":"AM7","v":{"$error":"#N/A"}},{"$f":"INDEX(AO$36:AO$37,MATCH(TRM,$A$36:$A$37,0))","v":{"$error":"#N/A"}},{"$f":"12/AO7","v":{"$error":"#N/A"}},{"$f":"AP7","v":{"$error":"#N/A"}},{"$f":"INDEX(AR$36:AR$37,MATCH(TRM,$A$36:$A$37,0))","v":{"$error":"#N/A"}},{"$f":"12/AR7","v":{"$error":"#N/A"}},{"$f":"AS7","v":{"$error":"#N/A"}},{"$f":"INDEX(AU$36:AU$37,MATCH(TRM,$A$36:$A$37,0))","v":{"$error":"#N/A"}},{"$f":"12/AU7","v":{"$error":"#N/A"}},{"$f":"AV7","v":{"$error":"#N/A"}}]
[1991,{"$error":"#N/A"},{"$f":"12/B8","v":{"$error":"#N/A"}},{"$f":"C8","v":{"$error":"#N/A"}},{"$error":"#N/A"},{"$f":"12/E8","v":{"$error":"#N/A"}},{"$f":"F8","v":{"$error":"#N/A"}},{"$error":"#N/A"},{"$f":"12/H8","v":{"$error":"#N/A"}},{"$f":"I8","v":{"$error":"#N/A"}},{"$error":"#N/A"},{"$f":"12/K8","v":{"$error":"#N/A"}},{"$f":"L8","v":{"$error":"#N/A"}},{"$error":"#N/A"},{"$f":"12/N8","v":{"$error":"#N/A"}},{"$f":"O8","v":{"$error":"#N/A"}},{"$error":"#N/A"},{"$f":"12/Q8","v":{"$error":"#N/A"}},{"$f":"R8","v":{"$error":"#N/A"}},{"$error":"#N/A"},{"$f":"12/T8","v":{"$error":"#N/A"}},{"$f":"U8","v":{"$error":"#N/A"}},{"$error":"#N/A"},{"$f":"12/W8","v":{"$error":"#N/A"}},{"$f":"X8","v":{"$error":"#N/A"}},{"$error":"#N/A"},{"$f":"12/Z8","v":{"$error":"#N/A"}},{"$f":"AA8","v":{"$error":"#N/A"}},{"$error":"#N/A"},{"$f":"12/AC8","v":{"$error":"#N/A"}},{"$f":"AD8","v":{"$error":"#N/A"}},{"$error":"#N/A"},{"$f":"12/AF8","v":{"$error":"#N/A"}},{"$f":"AG8","v":{"$error":"#N/A"}},{"$error":"#N/A"},{"$f":"12/AI8","v":{"$error":"#N/A"}},{"$f":"AJ8","v":{"$error":"#N/A"}},{"$error":"#N/A"},{"$f":"12/AL8","v":{"$error":"#N/A"}},{"$f":"AM8","v":{"$error":"#N/A"}},{"$error":"#N/A"},{"$f":"12/AO8","v":{"$error":"#N/A"}},{"$f":"AP8","v":{"$error":"#N/A"}},{"$error":"#N/A"},{"$f":"12/AR8","v":{"$error":"#N/A"}},{"$f":"AS8","v":{"$error":"#N/A"}},{"$error":"#N/A"},{"$f":"12/AU8","v":{"$error":"#N/A"}},{"$f":"AV8","v":{"$error":"#N/A"}}]
[1992,{"$error":"#N/A"},{"$error":"#N/A"},{"$error":"#N/A"},{"$error":"#N/A"},{"$error":"#N/A"},{"$error":"#N/A"},{"$error":"#N/A"},{"$error":"#N/A"},{"$error":"#N/A"},{"$error":"#N/A"},{"$error":"#N/A"},{"$error":"#N/A"},{"$error":"#N/A"},{"$error":"#N/A"},{"$error":"#N/A"},{"$error":"#N/A"},{"$error":"#N/A"},{"$error":"#N/A"},{"$error":"#N/A"},{"$error":"#N/A"},{"$error":"#N/A"},{"$error":"#N/A"},{"$error":"#N/A"},{"$error":"#N/A"},{"$error":"#N/A"},{"$error":"#N/A"},{"$error":"#N/A"},{"$error":"#N/A"},{"$error":"#N/A"},{"$error":"#N/A"},{"$error":"#N/A"},{"$error":"#N/A"},{"$error":"#N/A"},{"$error":"#N/A"},{"$error":"#N/A"},{"$error":"#N/A"},{"$error":"#N/A"},{"$error":"#N/A"},{"$error":"#N/A"},{"$error":"#N/A"},{"$error":"#N/A"},{"$error":"#N/A"},{"$error":"#N/A"},{"$error":"#N/A"},{"$error":"#N/A"},{"$error":"#N/A"},{"$error":"#N/A"},{"$error":"#N/A"}]
[1993,{"$error":"#N/A"},{"$error":"#N/A"},{"$error":"#N/A"},{"$error":"#N/A"},{"$error":"#N/A"},{"$error":"#N/A"},{"$error":"#N/A"},{"$error":"#N/A"},{"$error":"#N/A"},{"$error":"#N/A"},{"$error":"#N/A"},{"$error":"#N/A"},{"$error":"#N/A"},{"$error":"#N/A"},{"$error":"#N/A"},{"$error":"#N/A"},{"$error":"#N/A"},{"$error":"#N/A"},{"$error":"#N/A"},{"$error":"#N/A"},{"$error":"#N/A"},{"$error":"#N/A"},{"$error":"#N/A"},{"$error":"#N/A"},{"$error":"#N/A"},{"$error":"#N/A"},{"$error":"#N/A"},{"$error":"#N/A"},{"$error":"#N/A"},{"$error":"#N/A"},{"$error":"#N/A"},{"$error":"#N/A"},{"$error":"#N/A"},{"$error":"#N/A"},{"$error":"#N/A"},{"$error":"#N/A"},{"$error":"#N/A"},{"$error":"#N/A"},{"$error":"#N/A"},{"$error":"#N/A"},{"$error":"#N/A"},{"$error":"#N/A"},{"$error":"#N/A"},{"$error":"#N/A"},{"$error":"#N/A"},{"$error":"#N/A"},{"$error":"#N/A"},{"$error":"#N/A"}]
[1994,{"$error":"#N/A"},{"$error":"#N/A"},{"$error":"#N/A"},{"$error":"#N/A"},{"$error":"#N/A"},{"$error":"#N/A"},{"$error":"#N/A"},{"$error":"#N/A"},{"$error":"#N/A"},{"$error":"#N/A"},{"$error":"#N/A"},{"$error":"#N/A"},{"$error":"#N/A"},{"$error":"#N/A"},{"$error":"#N/A"},{"$error":"#N/A"},{"$error":"#N/A"},{"$error":"#N/A"},{"$error":"#N/A"},{"$error":"#N/A"},{"$error":"#N/A"},{"$error":"#N/A"},{"$error":"#N/A"},{"$error":"#N/A"},{"$error":"#N/A"},{"$error":"#N/A"},{"$error":"#N/A"},{"$error":"#N/A"},{"$error":"#N/A"},{"$error":"#N/A"},{"$error":"#N/A"},{"$error":"#N/A"},{"$error":"#N/A"},{"$error":"#N/A"},{"$error":"#N/A"},{"$error":"#N/A"},{"$error":"#N/A"},{"$error":"#N/A"},{"$error":"#N/A"},{"$error":"#N/A"},{"$error":"#N/A"},{"$error":"#N/A"},{"$error":"#N/A"},{"$error":"#N/A"},{"$error":"#N/A"},{"$error":"#N/A"},{"$error":"#N/A"},{"$error":"#N/A"}]
[1995,{"$error":"#N/A"},{"$error":"#N/A"},{"$error":"#N/A"},{"$error":"#N/A"},{"$error":"#N/A"},{"$error":"#N/A"},{"$error":"#N/A"},{"$error":"#N/A"},{"$error":"#N/A"},{"$error":"#N/A"},{"$error":"#N/A"},{"$error":"#N/A"},{"$error":"#N/A"},{"$error":"#N/A"},{"$error":"#N/A"},{"$error":"#N/A"},{"$error":"#N/A"},{"$error":"#N/A"},{"$error":"#N/A"},{"$error":"#N/A"},{"$error":"#N/A"},{"$error":"#N/A"},{"$error":"#N/A"},{"$error":"#N/A"},{"$error":"#N/A"},{"$error":"#N/A"},{"$error":"#N/A"},{"$error":"#N/A"},{"$error":"#N/A"},{"$error":"#N/A"},{"$error":"#N/A"},{"$error":"#N/A"},{"$error":"#N/A"},{"$error":"#N/A"},{"$error":"#N/A"},{"$error":"#N/A"},{"$error":"#N/A"},{"$error":"#N/A"},{"$error":"#N/A"},{"$error":"#N/A"},{"$error":"#N/A"},{"$error":"#N/A"},{"$error":"#N/A"},{"$error":"#N/A"},{"$error":"#N/A"},{"$error":"#N/A"},{"$error":"#N/A"},{"$error":"#N/A"}]
[1996,{"$error":"#N/A"},{"$error":"#N/A"},{"$error":"#N/A"},{"$error":"#N/A"},{"$error":"#N/A"},{"$error":"#N/A"},{"$error":"#N/A"},{"$error":"#N/A"},{"$error":"#N/A"},{"$error":"#N/A"},{"$error":"#N/A"},{"$error":"#N/A"},{"$error":"#N/A"},{"$error":"#N/A"},{"$error":"#N/A"},{"$error":"#N/A"},{"$error":"#N/A"},{"$error":"#N/A"},{"$error":"#N/A"},{"$error":"#N/A"},{"$error":"#N/A"},{"$error":"#N/A"},{"$error":"#N/A"},{"$error":"#N/A"},{"$error":"#N/A"},{"$error":"#N/A"},{"$error":"#N/A"},{"$error":"#N/A"},{"$error":"#N/A"},{"$error":"#N/A"},{"$error":"#N/A"},{"$error":"#N/A"},{"$error":"#N/A"},{"$error":"#N/A"},{"$error":"#N/A"},{"$error":"#N/A"},{"$error":"#N/A"},{"$error":"#N/A"},{"$error":"#N/A"},{"$error":"#N/A"},{"$error":"#N/A"},{"$error":"#N/A"},{"$error":"#N/A"},{"$error":"#N/A"},{"$error":"#N/A"},{"$error":"#N/A"},{"$error":"#N/A"},{"$error":"#N/A"}]
[1997,{"$error":"#N/A"},{"$error":"#N/A"},{"$error":"#N/A"},{"$error":"#N/A"},{"$error":"#N/A"},{"$error":"#N/A"},{"$error":"#N/A"},{"$error":"#N/A"},{"$error":"#N/A"},{"$error":"#N/A"},{"$error":"#N/A"},{"$error":"#N/A"},{"$error":"#N/A"},{"$error":"#N/A"},{"$error":"#N/A"},{"$error":"#N/A"},{"$error":"#N/A"},{"$error":"#N/A"},{"$error":"#N/A"},{"$error":"#N/A"},{"$error":"#N/A"},{"$error":"#N/A"},{"$error":"#N/A"},{"$error":"#N/A"},{"$error":"#N/A"},{"$error":"#N/A"},{"$error":"#N/A"},{"$error":"#N/A"},{"$error":"#N/A"},{"$error":"#N/A"},{"$error":"#N/A"},{"$error":"#N/A"},{"$error":"#N/A"},{"$error":"#N/A"},{"$error":"#N/A"},{"$error":"#N/A"},{"$error":"#N/A"},{"$error":"#N/A"},{"$error":"#N/A"},{"$error":"#N/A"},{"$error":"#N/A"},{"$error":"#N/A"},{"$error":"#N/A"},{"$error":"#N/A"},{"$error":"#N/A"},{"$error":"#N/A"},{"$error":"#N/A"},{"$error":"#N/A"}]
[1998,{"$error":"#N/A"},{"$error":"#N/A"},{"$error":"#N/A"},{"$error":"#N/A"},{"$error":"#N/A"},{"$error":"#N/A"},{"$error":"#N/A"},{"$error":"#N/A"},{"$error":"#N/A"},{"$error":"#N/A"},{"$error":"#N/A"},{"$error":"#N/A"},{"$error":"#N/A"},{"$error":"#N/A"},{"$error":"#N/A"},{"$error":"#N/A"},{"$error":"#N/A"},{"$error":"#N/A"},{"$error":"#N/A"},{"$error":"#N/A"},{"$error":"#N/A"},{"$error":"#N/A"},{"$error":"#N/A"},{"$error":"#N/A"},{"$error":"#N/A"},{"$error":"#N/A"},{"$error":"#N/A"},{"$error":"#N/A"},{"$error":"#N/A"},{"$error":"#N/A"},{"$error":"#N/A"},{"$error":"#N/A"},{"$error":"#N/A"},{"$error":"#N/A"},{"$error":"#N/A"},{"$error":"#N/A"},{"$error":"#N/A"},{"$error":"#N/A"},{"$error":"#N/A"},{"$error":"#N/A"},{"$error":"#N/A"},{"$error":"#N/A"},{"$error":"#N/A"},{"$error":"#N/A"},{"$error":"#N/A"},{"$error":"#N/A"},{"$error":"#N/A"},{"$error":"#N/A"}]
[1999,{"$error":"#N/A"},{"$error":"#N/A"},{"$error":"#N/A"},{"$error":"#N/A"},{"$error":"#N/A"},{"$error":"#N/A"},{"$error":"#N/A"},{"$error":"#N/A"},{"$error":"#N/A"},{"$error":"#N/A"},{"$error":"#N/A"},{"$error":"#N/A"},{"$error":"#N/A"},{"$error":"#N/A"},{"$error":"#N/A"},{"$error":"#N/A"},{"$error":"#N/A"},{"$error":"#N/A"},{"$error":"#N/A"},{"$error":"#N/A"},{"$error":"#N/A"},{"$error":"#N/A"},{"$error":"#N/A"},{"$error":"#N/A"},{"$error":"#N/A"},{"$error":"#N/A"},{"$error":"#N/A"},{"$error":"#N/A"},{"$error":"#N/A"},{"$error":"#N/A"},{"$error":"#N/A"},{"$error":"#N/A"},{"$error":"#N/A"},{"$error":"#N/A"},{"$error":"#N/A"},{"$error":"#N/A"},{"$error":"#N/A"},{"$error":"#N/A"},{"$error":"#N/A"},{"$error":"#N/A"},{"$error":"#N/A"},{"$error":"#N/A"},{"$error":"#N/A"},{"$error":"#N/A"},{"$error":"#N/A"},{"$error":"#N/A"},{"$error":"#N/A"},{"$error":"#N/A"}]
[2000,{"$error":"#N/A"},{"$error":"#N/A"},{"$error":"#N/A"},{"$error":"#N/A"},{"$error":"#N/A"},{"$error":"#N/A"},{"$error":"#N/A"},{"$error":"#N/A"},{"$error":"#N/A"},{"$error":"#N/A"},{"$error":"#N/A"},{"$error":"#N/A"},{"$error":"#N/A"},{"$error":"#N/A"},{"$error":"#N/A"},{"$error":"#N/A"},{"$error":"#N/A"},{"$error":"#N/A"},{"$error":"#N/A"},{"$error":"#N/A"},{"$error":"#N/A"},{"$error":"#N/A"},{"$error":"#N/A"},{"$error":"#N/A"},{"$error":"#N/A"},{"$error":"#N/A"},{"$error":"#N/A"},{"$error":"#N/A"},{"$error":"#N/A"},{"$error":"#N/A"},{"$error":"#N/A"},{"$error":"#N/A"},{"$error":"#N/A"},{"$error":"#N/A"},{"$error":"#N/A"},{"$error":"#N/A"},{"$error":"#N/A"},{"$error":"#N/A"},{"$error":"#N/A"},{"$error":"#N/A"},{"$error":"#N/A"},{"$error":"#N/A"},{"$error":"#N/A"},{"$error":"#N/A"},{"$error":"#N/A"},{"$error":"#N/A"},{"$error":"#N/A"},{"$error":"#N/A"}]
[2001,{"$error":"#N/A"},{"$error":"#N/A"},{"$error":"#N/A"},{"$error":"#N/A"},{"$error":"#N/A"},{"$error":"#N/A"},{"$error":"#N/A"},{"$error":"#N/A"},{"$error":"#N/A"},{"$error":"#N/A"},{"$error":"#N/A"},{"$error":"#N/A"},{"$error":"#N/A"},{"$error":"#N/A"},{"$error":"#N/A"},{"$error":"#N/A"},{"$error":"#N/A"},{"$error":"#N/A"},{"$error":"#N/A"},{"$error":"#N/A"},{"$error":"#N/A"},{"$error":"#N/A"},{"$error":"#N/A"},{"$error":"#N/A"},{"$error":"#N/A"},{"$error":"#N/A"},{"$error":"#N/A"},{"$error":"#N/A"},{"$error":"#N/A"},{"$error":"#N/A"},{"$error":"#N/A"},{"$error":"#N/A"},{"$error":"#N/A"},{"$error":"#N/A"},{"$error":"#N/A"},{"$error":"#N/A"},{"$error":"#N/A"},{"$error":"#N/A"},{"$error":"#N/A"},{"$error":"#N/A"},{"$error":"#N/A"},{"$error":"#N/A"},{"$error":"#N/A"},{"$error":"#N/A"},{"$error":"#N/A"},{"$error":"#N/A"},{"$error":"#N/A"},{"$error":"#N/A"}]
[2002,{"$error":"#N/A"},{"$error":"#N/A"},{"$error":"#N/A"},{"$error":"#N/A"},{"$error":"#N/A"},{"$error":"#N/A"},{"$error":"#N/A"},{"$error":"#N/A"},{"$error":"#N/A"},{"$error":"#N/A"},{"$error":"#N/A"},{"$error":"#N/A"},{"$error":"#N/A"},{"$error":"#N/A"},{"$error":"#N/A"},{"$error":"#N/A"},{"$error":"#N/A"},{"$error":"#N/A"},{"$error":"#N/A"},{"$error":"#N/A"},{"$error":"#N/A"},{"$error":"#N/A"},{"$error":"#N/A"},{"$error":"#N/A"},{"$error":"#N/A"},{"$error":"#N/A"},{"$error":"#N/A"},{"$error":"#N/A"},{"$error":"#N/A"},{"$error":"#N/A"},{"$error":"#N/A"},{"$error":"#N/A"},{"$error":"#N/A"},{"$error":"#N/A"},{"$error":"#N/A"},{"$error":"#N/A"},{"$error":"#N/A"},{"$error":"#N/A"},{"$error":"#N/A"},{"$error":"#N/A"},{"$error":"#N/A"},{"$error":"#N/A"},{"$error":"#N/A"},{"$error":"#N/A"},{"$error":"#N/A"},{"$error":"#N/A"},{"$error":"#N/A"},{"$error":"#N/A"}]
[2003,{"$error":"#N/A"},{"$error":"#N/A"},{"$error":"#N/A"},{"$error":"#N/A"},{"$error":"#N/A"},{"$error":"#N/A"},{"$error":"#N/A"},{"$error":"#N/A"},{"$error":"#N/A"},{"$error":"#N/A"},{"$error":"#N/A"},{"$error":"#N/A"},{"$error":"#N/A"},{"$error":"#N/A"},{"$error":"#N/A"},{"$error":"#N/A"},{"$error":"#N/A"},{"$error":"#N/A"},{"$error":"#N/A"},{"$error":"#N/A"},{"$error":"#N/A"},{"$error":"#N/A"},{"$error":"#N/A"},{"$error":"#N/A"},{"$error":"#N/A"},{"$error":"#N/A"},{"$error":"#N/A"},{"$error":"#N/A"},{"$error":"#N/A"},{"$error":"#N/A"},{"$error":"#N/A"},{"$error":"#N/A"},{"$error":"#N/A"},{"$error":"#N/A"},{"$error":"#N/A"},{"$error":"#N/A"},{"$error":"#N/A"},{"$error":"#N/A"},{"$error":"#N/A"},{"$error":"#N/A"},{"$error":"#N/A"},{"$error":"#N/A"},{"$error":"#N/A"},{"$error":"#N/A"},{"$error":"#N/A"},{"$error":"#N/A"},{"$error":"#N/A"},{"$error":"#N/A"}]
[2004,{"$error":"#N/A"},{"$error":"#N/A"},{"$error":"#N/A"},{"$error":"#N/A"},{"$error":"#N/A"},{"$error":"#N/A"},{"$error":"#N/A"},{"$f":"12/H21","v":{"$error":"#N/A"}},{"$error":"#N/A"},{"$error":"#N/A"},{"$error":"#N/A"},{"$error":"#N/A"},{"$error":"#N/A"},{"$error":"#N/A"},{"$error":"#N/A"},{"$error":"#N/A"},{"$error":"#N/A"},{"$error":"#N/A"},{"$error":"#N/A"},{"$error":"#N/A"},{"$error":"#N/A"},{"$error":"#N/A"},{"$error":"#N/A"},{"$error":"#N/A"},{"$error":"#N/A"},{"$error":"#N/A"},{"$error":"#N/A"},{"$error":"#N/A"},{"$error":"#N/A"},{"$error":"#N/A"},{"$error":"#N/A"},{"$error":"#N/A"},{"$error":"#N/A"},{"$error":"#N/A"},{"$error":"#N/A"},{"$error":"#N/A"},{"$error":"#N/A"},{"$error":"#N/A"},{"$error":"#N/A"},{"$error":"#N/A"},{"$error":"#N/A"},{"$error":"#N/A"},{"$error":"#N/A"},{"$error":"#N/A"},{"$error":"#N/A"},{"$error":"#N/A"},{"$error":"#N/A"},{"$error":"#N/A"}]
[2005,{"$error":"#N/A"},{"$error":"#N/A"},{"$error":"#N/A"},{"$error":"#N/A"},{"$error":"#N/A"},{"$error":"#N/A"},{"$error":"#N/A"},{"$error":"#N/A"},{"$error":"#N/A"},{"$error":"#N/A"},{"$error":"#N/A"},{"$error":"#N/A"},{"$error":"#N/A"},{"$error":"#N/A"},{"$error":"#N/A"},{"$error":"#N/A"},{"$error":"#N/A"},{"$error":"#N/A"},{"$error":"#N/A"},{"$error":"#N/A"},{"$error":"#N/A"},{"$error":"#N/A"},{"$error":"#N/A"},{"$error":"#N/A"},{"$error":"#N/A"},{"$error":"#N/A"},{"$error":"#N/A"},{"$error":"#N/A"},{"$error":"#N/A"},{"$error":"#N/A"},{"$error":"#N/A"},{"$error":"#N/A"},{"$error":"#N/A"},{"$error":"#N/A"},{"$error":"#N/A"},{"$error":"#N/A"},{"$error":"#N/A"},{"$error":"#N/A"},{"$error":"#N/A"},{"$error":"#N/A"},{"$error":"#N/A"},{"$error":"#N/A"},{"$error":"#N/A"},{"$error":"#N/A"},{"$error":"#N/A"},{"$error":"#N/A"},{"$error":"#N/A"},{"$error":"#N/A"}]
[2006,{"$error":"#N/A"},{"$error":"#N/A"},{"$error":"#N/A"},{"$error":"#N/A"},{"$error":"#N/A"},{"$error":"#N/A"},{"$error":"#N/A"},{"$error":"#N/A"},{"$error":"#N/A"},{"$error":"#N/A"},{"$error":"#N/A"},{"$error":"#N/A"},{"$error":"#N/A"},{"$error":"#N/A"},{"$error":"#N/A"},{"$error":"#N/A"},{"$error":"#N/A"},{"$error":"#N/A"},{"$error":"#N/A"},{"$error":"#N/A"},{"$error":"#N/A"},{"$error":"#N/A"},{"$error":"#N/A"},{"$error":"#N/A"},{"$error":"#N/A"},{"$error":"#N/A"},{"$error":"#N/A"},{"$error":"#N/A"},{"$error":"#N/A"},{"$error":"#N/A"},{"$error":"#N/A"},{"$error":"#N/A"},{"$error":"#N/A"},{"$error":"#N/A"},{"$error":"#N/A"},{"$error":"#N/A"},{"$error":"#N/A"},{"$error":"#N/A"},{"$error":"#N/A"},{"$error":"#N/A"},{"$error":"#N/A"},{"$error":"#N/A"},{"$error":"#N/A"},{"$error":"#N/A"},{"$error":"#N/A"},{"$error":"#N/A"},{"$error":"#N/A"},{"$error":"#N/A"}]
[2007,{"$error":"#N/A"},{"$f":"12/B24","v":{"$error":"#N/A"}},{"$f":"C24","v":{"$error":"#N/A"}},{"$error":"#N/A"},{"$f":"12/E24","v":{"$error":"#N/A"}},{"$f":"F24","v":{"$error":"#N/A"}},{"$error":"#N/A"},{"$f":"12/H24","v":{"$error":"#N/A"}},{"$f":"I24","v":{"$error":"#N/A"}},{"$error":"#N/A"},{"$f":"12/K24","v":{"$error":"#N/A"}},{"$f":"L24","v":{"$error":"#N/A"}},{"$error":"#N/A"},{"$f":"12/N24","v":{"$error":"#N/A"}},{"$f":"O24","v":{"$error":"#N/A"}},{"$error":"#N/A"},{"$f":"12/Q24","v":{"$error":"#N/A"}},{"$f":"R24","v":{"$error":"#N/A"}},{"$error":"#N/A"},{"$f":"12/T24","v":{"$error":"#N/A"}},{"$f":"U24","v":{"$error":"#N/A"}},{"$error":"#N/A"},{"$f":"12/W24","v":{"$error":"#N/A"}},{"$f":"X24","v":{"$error":"#N/A"}},{"$error":"#N/A"},{"$f":"12/Z24","v":{"$error":"#N/A"}},{"$f":"AA24","v":{"$error":"#N/A"}},{"$error":"#N/A"},{"$f":"12/AC24","v":{"$error":"#N/A"}},{"$f":"AD24","v":{"$error":"#N/A"}},{"$error":"#N/A"},{"$f":"12/AF24","v":{"$error":"#N/A"}},{"$f":"AG24","v":{"$error":"#N/A"}},{"$error":"#N/A"},{"$f":"12/AI24","v":{"$error":"#N/A"}},{"$f":"AJ24","v":{"$error":"#N/A"}},{"$error":"#N/A"},{"$f":"12/AL24","v":{"$error":"#N/A"}},{"$f":"AM24","v":{"$error":"#N/A"}},{"$error":"#N/A"},{"$f":"12/AO24","v":{"$error":"#N/A"}},{"$f":"AP24","v":{"$error":"#N/A"}},{"$error":"#N/A"},{"$f":"12/AR24","v":{"$error":"#N/A"}},{"$f":"AS24","v":{"$error":"#N/A"}},{"$error":"#N/A"},{"$f":"12/AU24","v":{"$error":"#N/A"}},{"$f":"AV24","v":{"$error":"#N/A"}}]
[2008,{"$error":"#N/A"},{"$error":"#N/A"},{"$error":"#N/A"},{"$error":"#N/A"},{"$error":"#N/A"},{"$error":"#N/A"},{"$error":"#N/A"},{"$error":"#N/A"},{"$error":"#N/A"},{"$error":"#N/A"},{"$error":"#N/A"},{"$error":"#N/A"},{"$error":"#N/A"},{"$error":"#N/A"},{"$error":"#N/A"},{"$error":"#N/A"},{"$error":"#N/A"},{"$error":"#N/A"},{"$error":"#N/A"},{"$error":"#N/A"},{"$error":"#N/A"},{"$error":"#N/A"},{"$error":"#N/A"},{"$error":"#N/A"},{"$error":"#N/A"},{"$error":"#N/A"},{"$error":"#N/A"},{"$error":"#N/A"},{"$error":"#N/A"},{"$error":"#N/A"},{"$error":"#N/A"},{"$error":"#N/A"},{"$error":"#N/A"},{"$error":"#N/A"},{"$error":"#N/A"},{"$error":"#N/A"},{"$error":"#N/A"},{"$error":"#N/A"},{"$error":"#N/A"},{"$error":"#N/A"},{"$error":"#N/A"},{"$error":"#N/A"},{"$error":"#N/A"},{"$error":"#N/A"},{"$error":"#N/A"},{"$error":"#N/A"},{"$error":"#N/A"},{"$error":"#N/A"}]
[2009,{"$error":"#N/A"},{"$error":"#N/A"},{"$error":"#N/A"},{"$error":"#N/A"},{"$error":"#N/A"},{"$error":"#N/A"},{"$error":"#N/A"},{"$error":"#N/A"},{"$error":"#N/A"},{"$error":"#N/A"},{"$error":"#N/A"},{"$error":"#N/A"},{"$error":"#N/A"},{"$error":"#N/A"},{"$error":"#N/A"},{"$error":"#N/A"},{"$error":"#N/A"},{"$error":"#N/A"},{"$error":"#N/A"},{"$error":"#N/A"},{"$error":"#N/A"},{"$error":"#N/A"},{"$error":"#N/A"},{"$error":"#N/A"},{"$error":"#N/A"},{"$error":"#N/A"},{"$error":"#N/A"},{"$error":"#N/A"},{"$error":"#N/A"},{"$error":"#N/A"},{"$error":"#N/A"},{"$error":"#N/A"},{"$error":"#N/A"},{"$error":"#N/A"},{"$error":"#N/A"},{"$error":"#N/A"},{"$error":"#N/A"},{"$error":"#N/A"},{"$error":"#N/A"},{"$error":"#N/A"},{"$error":"#N/A"},{"$error":"#N/A"},{"$error":"#N/A"},{"$error":"#N/A"},{"$error":"#N/A"},{"$error":"#N/A"},{"$error":"#N/A"},{"$error":"#N/A"}]
[2010,{"$error":"#N/A"},{"$error":"#N/A"},{"$error":"#N/A"},{"$error":"#N/A"},{"$error":"#N/A"},{"$error":"#N/A"},{"$error":"#N/A"},{"$error":"#N/A"},{"$error":"#N/A"},{"$error":"#N/A"},{"$error":"#N/A"},{"$error":"#N/A"},{"$error":"#N/A"},{"$error":"#N/A"},{"$error":"#N/A"},{"$error":"#N/A"},{"$error":"#N/A"},{"$error":"#N/A"},{"$error":"#N/A"},{"$error":"#N/A"},{"$error":"#N/A"},{"$error":"#N/A"},{"$error":"#N/A"},{"$error":"#N/A"},{"$error":"#N/A"},{"$error":"#N/A"},{"$error":"#N/A"},{"$error":"#N/A"},{"$error":"#N/A"},{"$error":"#N/A"},{"$error":"#N/A"},{"$error":"#N/A"},{"$error":"#N/A"},{"$error":"#N/A"},{"$error":"#N/A"},{"$error":"#N/A"},{"$error":"#N/A"},{"$error":"#N/A"},{"$error":"#N/A"},{"$error":"#N/A"},{"$error":"#N/A"},{"$error":"#N/A"},{"$error":"#N/A"},{"$error":"#N/A"},{"$error":"#N/A"},{"$error":"#N/A"},{"$error":"#N/A"},{"$error":"#N/A"}]
[2011,{"$error":"#N/A"},{"$error":"#N/A"},{"$error":"#N/A"},{"$error":"#N/A"},{"$error":"#N/A"},{"$error":"#N/A"},{"$error":"#N/A"},{"$error":"#N/A"},{"$error":"#N/A"},{"$error":"#N/A"},{"$error":"#N/A"},{"$error":"#N/A"},{"$error":"#N/A"},{"$error":"#N/A"},{"$error":"#N/A"},{"$error":"#N/A"},{"$error":"#N/A"},{"$error":"#N/A"},{"$error":"#N/A"},{"$error":"#N/A"},{"$error":"#N/A"},{"$error":"#N/A"},{"$error":"#N/A"},{"$error":"#N/A"},{"$error":"#N/A"},{"$error":"#N/A"},{"$error":"#N/A"},{"$error":"#N/A"},{"$error":"#N/A"},{"$error":"#N/A"},{"$error":"#N/A"},{"$error":"#N/A"},{"$error":"#N/A"},{"$error":"#N/A"},{"$error":"#N/A"},{"$error":"#N/A"},{"$error":"#N/A"},{"$error":"#N/A"},{"$error":"#N/A"},{"$error":"#N/A"},{"$error":"#N/A"},{"$error":"#N/A"},{"$error":"#N/A"},{"$error":"#N/A"},{"$error":"#N/A"},{"$error":"#N/A"},{"$error":"#N/A"},{"$error":"#N/A"}]
[2012,{"$error":"#N/A"},{"$error":"#N/A"},{"$error":"#N/A"},{"$error":"#N/A"},{"$error":"#N/A"},{"$error":"#N/A"},{"$error":"#N/A"},{"$error":"#N/A"},{"$error":"#N/A"},{"$error":"#N/A"},{"$error":"#N/A"},{"$error":"#N/A"},{"$error":"#N/A"},{"$error":"#N/A"},{"$error":"#N/A"},{"$error":"#N/A"},{"$error":"#N/A"},{"$error":"#N/A"},{"$error":"#N/A"},{"$error":"#N/A"},{"$error":"#N/A"},{"$error":"#N/A"},{"$error":"#N/A"},{"$error":"#N/A"},{"$error":"#N/A"},{"$error":"#N/A"},{"$error":"#N/A"},{"$error":"#N/A"},{"$error":"#N/A"},{"$error":"#N/A"},{"$error":"#N/A"},{"$error":"#N/A"},{"$error":"#N/A"},{"$error":"#N/A"},{"$error":"#N/A"},{"$error":"#N/A"},{"$error":"#N/A"},{"$error":"#N/A"},{"$error":"#N/A"},{"$error":"#N/A"},{"$error":"#N/A"},{"$error":"#N/A"},{"$error":"#N/A"},{"$error":"#N/A"},{"$error":"#N/A"},{"$error":"#N/A"},{"$error":"#N/A"},{"$error":"#N/A"}]
[2013,{"$error":"#N/A"},{"$error":"#N/A"},{"$error":"#N/A"},{"$error":"#N/A"},{"$error":"#N/A"},{"$error":"#N/A"},{"$error":"#N/A"},{"$error":"#N/A"},{"$error":"#N/A"},{"$error":"#N/A"},{"$error":"#N/A"},{"$error":"#N/A"},{"$error":"#N/A"},{"$error":"#N/A"},{"$error":"#N/A"},{"$error":"#N/A"},{"$error":"#N/A"},{"$error":"#N/A"},{"$error":"#N/A"},{"$error":"#N/A"},{"$error":"#N/A"},{"$error":"#N/A"},{"$error":"#N/A"},{"$error":"#N/A"},{"$error":"#N/A"},{"$error":"#N/A"},{"$error":"#N/A"},{"$error":"#N/A"},{"$error":"#N/A"},{"$error":"#N/A"},{"$error":"#N/A"},{"$error":"#N/A"},{"$error":"#N/A"},{"$error":"#N/A"},{"$error":"#N/A"},{"$error":"#N/A"},{"$error":"#N/A"},{"$error":"#N/A"},{"$error":"#N/A"},{"$error":"#N/A"},{"$error":"#N/A"},{"$error":"#N/A"},{"$error":"#N/A"},{"$error":"#N/A"},{"$error":"#N/A"},{"$error":"#N/A"},{"$error":"#N/A"},{"$error":"#N/A"}]
[2014,{"$error":"#N/A"},{"$error":"#N/A"},{"$error":"#N/A"},{"$error":"#N/A"},{"$error":"#N/A"},{"$error":"#N/A"},{"$error":"#N/A"},{"$error":"#N/A"},{"$error":"#N/A"},{"$error":"#N/A"},{"$error":"#N/A"},{"$error":"#N/A"},{"$error":"#N/A"},{"$error":"#N/A"},{"$error":"#N/A"},{"$error":"#N/A"},{"$error":"#N/A"},{"$error":"#N/A"},{"$error":"#N/A"},{"$error":"#N/A"},{"$error":"#N/A"},{"$error":"#N/A"},{"$error":"#N/A"},{"$error":"#N/A"},{"$error":"#N/A"},{"$error":"#N/A"},{"$error":"#N/A"},{"$error":"#N/A"},{"$error":"#N/A"},{"$error":"#N/A"},{"$error":"#N/A"},{"$error":"#N/A"},{"$error":"#N/A"},{"$error":"#N/A"},{"$error":"#N/A"},{"$error":"#N/A"},{"$error":"#N/A"},{"$error":"#N/A"},{"$error":"#N/A"},{"$error":"#N/A"},{"$error":"#N/A"},{"$error":"#N/A"},{"$error":"#N/A"},{"$error":"#N/A"},{"$error":"#N/A"},{"$error":"#N/A"},{"$error":"#N/A"},{"$error":"#N/A"}]
[2015,{"$error":"#N/A"},{"$error":"#N/A"},{"$error":"#N/A"},{"$error":"#N/A"},{"$error":"#N/A"},{"$error":"#N/A"},{"$error":"#N/A"},{"$error":"#N/A"},{"$error":"#N/A"},{"$error":"#N/A"},{"$error":"#N/A"},{"$error":"#N/A"},{"$error":"#N/A"},{"$error":"#N/A"},{"$error":"#N/A"},{"$error":"#N/A"},{"$error":"#N/A"},{"$error":"#N/A"},{"$error":"#N/A"},{"$error":"#N/A"},{"$error":"#N/A"},{"$error":"#N/A"},{"$error":"#N/A"},{"$error":"#N/A"},{"$error":"#N/A"},{"$error":"#N/A"},{"$error":"#N/A"},{"$error":"#N/A"},{"$error":"#N/A"},{"$error":"#N/A"},{"$error":"#N/A"},{"$error":"#N/A"},{"$error":"#N/A"},{"$error":"#N/A"},{"$error":"#N/A"},{"$error":"#N/A"},{"$error":"#N/A"},{"$error":"#N/A"},{"$error":"#N/A"},{"$error":"#N/A"},{"$error":"#N/A"},{"$error":"#N/A"},{"$error":"#N/A"},{"$error":"#N/A"},{"$error":"#N/A"},{"$error":"#N/A"},{"$error":"#N/A"},{"$error":"#N/A"}]
[2016,{"$error":"#N/A"},{"$error":"#N/A"},{"$error":"#N/A"},{"$error":"#N/A"},{"$error":"#N/A"},{"$error":"#N/A"},{"$error":"#N/A"},{"$error":"#N/A"},{"$error":"#N/A"},{"$error":"#N/A"},{"$error":"#N/A"},{"$error":"#N/A"},{"$error":"#N/A"},{"$error":"#N/A"},{"$error":"#N/A"},{"$error":"#N/A"},{"$error":"#N/A"},{"$error":"#N/A"},{"$error":"#N/A"},{"$error":"#N/A"},{"$error":"#N/A"},{"$error":"#N/A"},{"$error":"#N/A"},{"$error":"#N/A"},{"$error":"#N/A"},{"$error":"#N/A"},{"$error":"#N/A"},{"$error":"#N/A"},{"$error":"#N/A"},{"$error":"#N/A"},{"$error":"#N/A"},{"$error":"#N/A"},{"$error":"#N/A"},{"$error":"#N/A"},{"$error":"#N/A"},{"$error":"#N/A"},{"$error":"#N/A"},{"$error":"#N/A"},{"$error":"#N/A"},{"$error":"#N/A"},{"$error":"#N/A"},{"$error":"#N/A"},{"$error":"#N/A"},{"$error":"#N/A"},{"$error":"#N/A"},{"$error":"#N/A"},{"$error":"#N/A"},{"$error":"#N/A"}]
[2017,{"$error":"#N/A"},{"$error":"#N/A"},{"$error":"#N/A"},{"$error":"#N/A"},{"$error":"#N/A"},{"$error":"#N/A"},{"$error":"#N/A"},{"$error":"#N/A"},{"$error":"#N/A"},{"$error":"#N/A"},{"$error":"#N/A"},{"$error":"#N/A"},{"$error":"#N/A"},{"$error":"#N/A"},{"$error":"#N/A"},{"$error":"#N/A"},{"$error":"#N/A"},{"$error":"#N/A"},{"$error":"#N/A"},{"$error":"#N/A"},{"$error":"#N/A"},{"$error":"#N/A"},{"$error":"#N/A"},{"$error":"#N/A"},{"$error":"#N/A"},{"$error":"#N/A"},{"$error":"#N/A"},{"$error":"#N/A"},{"$error":"#N/A"},{"$error":"#N/A"},{"$error":"#N/A"},{"$error":"#N/A"},{"$error":"#N/A"},{"$error":"#N/A"},{"$error":"#N/A"},{"$error":"#N/A"},{"$error":"#N/A"},{"$error":"#N/A"},{"$error":"#N/A"},{"$error":"#N/A"},{"$error":"#N/A"},{"$error":"#N/A"},{"$error":"#N/A"},{"$error":"#N/A"},{"$error":"#N/A"},{"$error":"#N/A"},{"$error":"#N/A"},{"$error":"#N/A"}]
[2018,{"$error":"#N/A"},{"$error":"#N/A"},{"$error":"#N/A"},{"$error":"#N/A"},{"$error":"#N/A"},{"$error":"#N/A"},{"$error":"#N/A"},{"$error":"#N/A"},{"$error":"#N/A"},{"$error":"#N/A"},{"$error":"#N/A"},{"$error":"#N/A"},{"$error":"#N/A"},{"$error":"#N/A"},{"$error":"#N/A"},{"$error":"#N/A"},{"$error":"#N/A"},{"$error":"#N/A"},{"$error":"#N/A"},{"$error":"#N/A"},{"$error":"#N/A"},{"$error":"#N/A"},{"$error":"#N/A"},{"$error":"#N/A"},{"$error":"#N/A"},{"$error":"#N/A"},{"$error":"#N/A"},{"$error":"#N/A"},{"$error":"#N/A"},{"$error":"#N/A"},{"$error":"#N/A"},{"$error":"#N/A"},{"$error":"#N/A"},{"$error":"#N/A"},{"$error":"#N/A"},{"$error":"#N/A"},{"$error":"#N/A"},{"$error":"#N/A"},{"$error":"#N/A"},{"$error":"#N/A"},{"$error":"#N/A"},{"$error":"#N/A"},{"$error":"#N/A"},{"$error":"#N/A"},{"$error":"#N/A"},{"$error":"#N/A"},{"$error":"#N/A"},{"$error":"#N/A"}]
["ARTRM8",11,{"$f":"12/B36","v":1.0909090909090908},{"$f":"C36","v":1.0909090909090908},10.9,{"$f":"12/E36","v":1.1009174311926606},{"$f":"F36","v":1.1009174311926606},10.7,{"$f":"12/H36","v":1.1214953271028039},{"$f":"I36","v":1.1214953271028039},9.4,{"$f":"12/K36","v":1.2765957446808509},{"$f":"L36","v":1.2765957446808509},9.4,{"$f":"12/N36","v":1.2765957446808509},1.2765957446808509,10,1.2,1.2,9.6,{"$f":"12/T36","v":1.25},1.25,9.6,1.25,1.25,9.6,{"$f":"12/Z36","v":1.25},1.25,9.6,{"$f":"12/AC36","v":1.25},1.25,9.8000000000000007,1.2244897959183672,1.2244897959183672,9.3000000000000007,1.2903225806451613,1.2903225806451613,9.3000000000000007,1.2903225806451613,1.2903225806451613,8.6999999999999993,{"$f":"12/AO36","v":1.3793103448275863},1.3793103448275863,9.5,{"$f":"12/AR36","v":1.263157894736842},1.263157894736842,10.4,{"$f":"12/AU36","v":1.1538461538461537},1.1538461538461537,null,"IECC2018"]
["CPS",11,1.0909090909090908,1.0909090909090908,10.9,1.1009174311926606,1.1009174311926606,10.7,1.1214953271028039,1.1214953271028039,9.4,1.2765957446808509,1.2765957446808509,9,{"$f":"12/N37","v":1.3333333333333333},1.3333333333333333,10,1.2,1.2,9.6,{"$f":"12/T37","v":1.25},1.25,9.5,1.263157894736842,1.263157894736842,9.4,{"$f":"12/Z37","v":1.2765957446808509},1.2765957446808509,9.4,{"$f":"12/AC37","v":1.2765957446808509},1.2765957446808509,9.8000000000000007,1.2244897959183672,1.2244897959183672,9.3000000000000007,1.2903225806451613,1.2903225806451613,9.3000000000000007,1.2903225806451613,1.2903225806451613,8.6999999999999993,{"$f":"12/AO37","v":1.3793103448275863},1.3793103448275863,9.5,{"$f":"12/AR37","v":1.263157894736842},1.263157894736842,10.4,{"$f":"12/AU37","v":1.1538461538461537},1.1538461538461537,null,"IECC2018"]

{"sheet":"SPVAC","index":12,"n_rows":40,"n_cols":30,"rows_kept":40,"cut":false,"hidden":true,"merged":[[3,29,5,29],[6,0,34,0],[3,2,3,8],[3,14,3,24],[3,0,5,1],[4,3,4,4],[4,6,4,7],[4,9,4,10],[4,16,4,17],[4,21,4,22],[4,26,4,27],[4,14,4,15],[4,19,4,20],[4,24,4,25],[2,2,2,4],[2,5,2,7],[2,8,2,10],[2,24,2,27],[2,19,2,22],[2,14,2,17]]}
["Efficiency Levels for Single Package Vertical Air Conditioners & Heat Pumps"]
[]
[null,null,"DXAirCooledSinglePackageVerticalAirConditionerLessthan5.42tons",null,null,"DXAirCooledSinglePackageVerticalAirConditioner5.42to11.25tons",null,null,"DXAirCooledSinglePackageVerticalAirConditioner11.25to20tons",null,null,null,null,null,"DXAirCooledSinglePackageVerticalHeatPumpCoolingLessthan5.42tons",null,null,null,null,"DXAirCooledSinglePackageVerticalHeatPumpCooling5.42to11.25tons",null,null,null,null,"DXAirCooledSinglePackageVerticalHeatPumpCooling11.25to20tons"]
["Manuf. Year",null,"SPVAC - Cooling Mode",null,null,null,null,null,null,null,null,null,null,null,"SPVHP - Cooling Mode",null,null,null,null,null,null,null,null,null,null,null,null,null,null,"Applicable Standard"]
[null,null,"< 65,000 Btu/h","kW/ton",null,">=65,000, < 135,000 Btu/h","kW/ton",null,">= 135,000, < 240,000 Btu/h","kW/ton",null,null,null,null,"< 65,000 Btu/h",null,"kW/ton",null,null,">=65,000, < 135,000 Btu/h",null,"kW/ton",null,null,">= 135,000, < 240,000 Btu/h",null,"kW/ton"]
[null,null,"EER","Full","Part","EER","Full","Part","EER","Full","Part",null,null,null,"EER","COP","Full","Part","Heating","EER","COP","Full","Part","Heating","EER","COP","Full","Part","Heating"]
["BASELINE EFFICIENCIES",1990,{"$f":"C$21","v":8.6},{"$f":"12/C7","v":1.3953488372093024},{"$f":"12/C7","v":1.3953488372093024},{"$f":"F$21","v":8.6},{"$f":"12/F7","v":1.3953488372093024},{"$f":"12/F7","v":1.3953488372093024},{"$f":"I$21","v":8.6},{"$f":"12/I7","v":1.3953488372093024},{"$f":"12/I7","v":1.3953488372093024},null,null,null,{"$f":"O$21","v":8.6},2.7,{"$f":"12/O7","v":1.3953488372093024},{"$f":"12/O7","v":1.3953488372093024},{"$f":"12/3.412/P7","v":1.3025921583952065},{"$f":"T$21","v":8.6},2.7,{"$f":"12/T7","v":1.3953488372093024},{"$f":"12/T7","v":1.3953488372093024},{"$f":"12/3.412/U7","v":1.3025921583952065},{"$f":"Y$21","v":8.6},2.7,{"$f":"12/Y7","v":1.3953488372093024},{"$f":"12/Y7","v":1.3953488372093024},{"$f":"12/3.412/Z7","v":1.3025921583952065},"ASHRAE 90.1--1989"]
[null,1991,8.6,{"$f":"12/C8","v":1.3953488372093024},{"$f":"12/C8","v":1.3953488372093024},8.6,{"$f":"12/F8","v":1.3953488372093024},{"$f":"12/F8","v":1.3953488372093024},8.6,{"$f":"12/I8","v":1.3953488372093024},{"$f":"12/I8","v":1.3953488372093024},null,null,null,8.6,2.7,{"$f":"12/O8","v":1.3953488372093024},{"$f":"12/O8","v":1.3953488372093024},1.3025921583952065,8.6,2.7,{"$f":"12/T8","v":1.3953488372093024},{"$f":"12/T8","v":1.3953488372093024},1.3025921583952065,8.6,2.7,{"$f":"12/Y8","v":1.3953488372093024},{"$f":"12/Y8","v":1.3953488372093024},1.3025921583952065,"ASHRAE 90.1--1989"]
[null,1992,8.6,1.3953488372093024,1.3953488372093024,8.6,1.3953488372093024,1.3953488372093024,8.6,1.3953488372093024,1.3953488372093024,null,null,null,8.6,2.7,1.3953488372093024,1.3953488372093024,1.3025921583952065,8.6,2.7,1.3953488372093024,1.3953488372093024,1.3025921583952065,8.6,2.7,1.3953488372093024,1.3953488372093024,1.3025921583952065,"ASHRAE 90.1--1989"]
[null,1993,8.6,1.3953488372093024,1.3953488372093024,8.6,1.3953488372093024,1.3953488372093024,8.6,1.3953488372093024,1.3953488372093024,null,null,null,8.6,2.7,1.3953488372093024,1.3953488372093024,1.3025921583952065,8.6,2.7,1.3953488372093024,1.3953488372093024,1.3025921583952065,8.6,2.7,1.3953488372093024,1.3953488372093024,1.3025921583952065,"ASHRAE 90.1--1989"]
[null,1994,8.6,1.3953488372093024,1.3953488372093024,8.6,1.3953488372093024,1.3953488372093024,8.6,1.3953488372093024,1.3953488372093024,null,null,null,8.6,2.7,1.3953488372093024,1.3953488372093024,1.3025921583952065,8.6,2.7,1.3953488372093024,1.3953488372093024,1.3025921583952065,8.6,2.7,1.3953488372093024,1.3953488372093024,1.3025921583952065,"ASHRAE 90.1--1989"]
[null,1995,8.6,1.3953488372093024,1.3953488372093024,8.6,1.3953488372093024,1.3953488372093024,8.6,1.3953488372093024,1.3953488372093024,null,null,null,8.6,2.7,1.3953488372093024,1.3953488372093024,1.3025921583952065,8.6,2.7,1.3953488372093024,1.3953488372093024,1.3025921583952065,8.6,2.7,1.3953488372093024,1.3953488372093024,1.3025921583952065,"ASHRAE 90.1--1989"]
[null,1996,8.6,1.3953488372093024,1.3953488372093024,8.6,1.3953488372093024,1.3953488372093024,8.6,1.3953488372093024,1.3953488372093024,null,null,null,8.6,2.7,1.3953488372093024,1.3953488372093024,1.3025921583952065,8.6,2.7,1.3953488372093024,1.3953488372093024,1.3025921583952065,8.6,2.7,1.3953488372093024,1.3953488372093024,1.3025921583952065,"ASHRAE 90.1--1989"]
[null,1997,8.6,1.3953488372093024,1.3953488372093024,8.6,1.3953488372093024,1.3953488372093024,8.6,1.3953488372093024,1.3953488372093024,null,null,null,8.6,2.7,1.3953488372093024,1.3953488372093024,1.3025921583952065,8.6,2.7,1.3953488372093024,1.3953488372093024,1.3025921583952065,8.6,2.7,1.3953488372093024,1.3953488372093024,1.3025921583952065,"ASHRAE 90.1--1989"]
[null,1998,8.6,1.3953488372093024,1.3953488372093024,8.6,1.3953488372093024,1.3953488372093024,8.6,1.3953488372093024,1.3953488372093024,null,null,null,8.6,2.7,1.3953488372093024,1.3953488372093024,1.3025921583952065,8.6,2.7,1.3953488372093024,1.3953488372093024,1.3025921583952065,8.6,2.7,1.3953488372093024,1.3953488372093024,1.3025921583952065,"ASHRAE 90.1--1989"]
[null,1999,8.6,1.3953488372093024,1.3953488372093024,8.6,1.3953488372093024,1.3953488372093024,8.6,1.3953488372093024,1.3953488372093024,null,null,null,8.6,2.7,1.3953488372093024,1.3953488372093024,1.3025921583952065,8.6,2.7,1.3953488372093024,1.3953488372093024,1.3025921583952065,8.6,2.7,1.3953488372093024,1.3953488372093024,1.3025921583952065,"ASHRAE 90.1--1999"]
[null,2000,8.6,1.3953488372093024,1.3953488372093024,8.6,1.3953488372093024,1.3953488372093024,8.6,1.3953488372093024,1.3953488372093024,null,null,null,8.6,2.7,1.3953488372093024,1.3953488372093024,1.3025921583952065,8.6,2.7,1.3953488372093024,1.3953488372093024,1.3025921583952065,8.6,2.7,1.3953488372093024,1.3953488372093024,1.3025921583952065,"ASHRAE 90.1--1999"]
[null,2001,8.6,1.3953488372093024,1.3953488372093024,8.6,1.3953488372093024,1.3953488372093024,8.6,1.3953488372093024,1.3953488372093024,null,null,null,8.6,2.7,1.3953488372093024,1.3953488372093024,1.3025921583952065,8.6,2.7,1.3953488372093024,1.3953488372093024,1.3025921583952065,8.6,2.7,1.3953488372093024,1.3953488372093024,1.3025921583952065,"ASHRAE 90.1--1999 "]
[null,2002,8.6,1.3953488372093024,1.3953488372093024,8.6,1.3953488372093024,1.3953488372093024,8.6,1.3953488372093024,1.3953488372093024,null,null,null,8.6,2.7,1.3953488372093024,1.3953488372093024,1.3025921583952065,8.6,2.7,1.3953488372093024,1.3953488372093024,1.3025921583952065,8.6,2.7,1.3953488372093024,1.3953488372093024,1.3025921583952065,"ASHRAE 90.1--1999 (as of 10/29/2001)"]
[null,2003,8.6,1.3953488372093024,1.3953488372093024,8.6,1.3953488372093024,1.3953488372093024,8.6,1.3953488372093024,1.3953488372093024,null,null,null,8.6,2.7,1.3953488372093024,1.3953488372093024,1.3025921583952065,8.6,2.7,1.3953488372093024,1.3953488372093024,1.3025921583952065,8.6,2.7,1.3953488372093024,1.3953488372093024,1.3025921583952065,"ASHRAE 90.1--1999 (as of 10/29/2001)"]
[null,2004,8.6,1.3953488372093024,1.3953488372093024,8.6,1.3953488372093024,1.3953488372093024,8.6,1.3953488372093024,1.3953488372093024,null,null,null,8.6,2.7,1.3953488372093024,1.3953488372093024,1.3025921583952065,8.6,2.7,1.3953488372093024,1.3953488372093024,1.3025921583952065,8.6,2.7,1.3953488372093024,1.3953488372093024,1.3025921583952065,"ASHRAE 90.1--2004"]
[null,2005,8.6,1.3953488372093024,1.3953488372093024,8.6,1.3953488372093024,1.3953488372093024,8.6,1.3953488372093024,1.3953488372093024,null,null,null,8.6,2.7,1.3953488372093024,1.3953488372093024,1.3025921583952065,8.6,2.7,1.3953488372093024,1.3953488372093024,1.3025921583952065,8.6,2.7,1.3953488372093024,1.3953488372093024,1.3025921583952065,"ASHRAE 90.1--2004"]
[null,2006,8.6,1.3953488372093024,1.3953488372093024,8.6,1.3953488372093024,1.3953488372093024,8.6,1.3953488372093024,1.3953488372093024,null,null,null,8.6,2.7,1.3953488372093024,1.3953488372093024,1.3025921583952065,8.6,2.7,1.3953488372093024,1.3953488372093024,1.3025921583952065,8.6,2.7,1.3953488372093024,1.3953488372093024,1.3025921583952065,"Federal Standard/ASHRAE 90.1--2004"]
[null,2007,9,1.3333333333333333,1.3333333333333333,8.9,1.348314606741573,1.348314606741573,8.6,1.3953488372093024,1.3953488372093024,null,null,null,9,3,1.3333333333333333,1.3333333333333333,1.1723329425556859,8.9,3,1.348314606741573,1.348314606741573,1.1723329425556859,8.6,2.9,1.3953488372093024,1.3953488372093024,1.2127582164369164,"Federal Standard/ASHRAE 90.1-2007 "]
[null,2008,9,1.3333333333333333,1.3333333333333333,8.9,1.348314606741573,1.348314606741573,8.6,1.3953488372093024,1.3953488372093024,null,null,null,9,3,1.3333333333333333,1.3333333333333333,1.1723329425556859,8.9,3,1.348314606741573,1.348314606741573,1.1723329425556859,8.6,2.9,1.3953488372093024,1.3953488372093024,1.2127582164369164,"Federal Standard/ASHRAE 90.1-2007 "]
[null,2009,9,1.3333333333333333,1.3333333333333333,8.9,1.348314606741573,1.348314606741573,8.6,1.3953488372093024,1.3953488372093024,null,null,null,9,3,1.3333333333333333,1.3333333333333333,1.1723329425556859,8.9,3,1.348314606741573,1.348314606741573,1.1723329425556859,8.6,2.9,1.3953488372093024,1.3953488372093024,1.2127582164369164,"Federal Standard/ASHRAE 90.1-2007"]
[null,2010,9,1.3333333333333333,1.3333333333333333,8.9,1.348314606741573,1.348314606741573,8.6,1.3953488372093024,1.3953488372093024,null,null,null,9,3,1.3333333333333333,1.3333333333333333,1.1723329425556859,8.9,3,1.348314606741573,1.348314606741573,1.1723329425556859,8.6,2.9,1.3953488372093024,1.3953488372093024,1.2127582164369164,"Federal Standard/ASHRAE 90.1-2007 (as of 1/1/2010)"]
[null,2011,9,1.3333333333333333,1.3333333333333333,8.9,1.348314606741573,1.348314606741573,8.6,1.3953488372093024,1.3953488372093024,null,null,null,9,3,1.3333333333333333,1.3333333333333333,1.1723329425556859,8.9,3,1.348314606741573,1.348314606741573,1.1723329425556859,8.6,2.9,1.3953488372093024,1.3953488372093024,1.2127582164369164,"Federal Standard/ASHRAE 90.1-2007 (as of 1/1/2010)"]
[null,2012,9,1.3333333333333333,1.3333333333333333,8.9,1.348314606741573,1.348314606741573,8.6,1.3953488372093024,1.3953488372093024,null,null,null,9,3,1.3333333333333333,1.3333333333333333,1.1723329425556859,8.9,3,1.348314606741573,1.348314606741573,1.1723329425556859,8.6,2.9,1.3953488372093024,1.3953488372093024,1.2127582164369164,"Federal Standard/ASHRAE 90.1-2007 (as of 1/1/2010)"]
[null,2013,9,{"$f":"12/C30","v":1.3333333333333333},{"$f":"12/C30","v":1.3333333333333333},8.9,{"$f":"12/F30","v":1.348314606741573},{"$f":"12/F30","v":1.348314606741573},8.6,{"$f":"12/I30","v":1.3953488372093024},{"$f":"12/I30","v":1.3953488372093024},null,null,null,9,3,{"$f":"12/O30","v":1.3333333333333333},{"$f":"12/O30","v":1.3333333333333333},{"$f":"12/3.412/P30","v":1.1723329425556859},8.9,3,{"$f":"12/T30","v":1.348314606741573},{"$f":"12/T30","v":1.348314606741573},{"$f":"12/3.412/U30","v":1.1723329425556859},8.6,2.9,{"$f":"12/Y30","v":1.3953488372093024},{"$f":"12/Y30","v":1.3953488372093024},{"$f":"12/3.412/Z30","v":1.2127582164369164}]
[null,2014,9,1.3333333333333333,1.3333333333333333,8.9,1.348314606741573,1.348314606741573,8.6,1.3953488372093024,1.3953488372093024,null,null,null,9,3,1.3333333333333333,1.3333333333333333,1.1723329425556859,8.9,3,1.348314606741573,1.348314606741573,1.1723329425556859,8.6,2.9,1.3953488372093024,1.3953488372093024,1.2127582164369164]
[null,2015,9,1.3333333333333333,1.3333333333333333,8.9,1.348314606741573,1.348314606741573,8.6,1.3953488372093024,1.3953488372093024,null,null,null,9,3,1.3333333333333333,1.3333333333333333,1.1723329425556859,8.9,3,1.348314606741573,1.348314606741573,1.1723329425556859,8.6,2.9,1.3953488372093024,1.3953488372093024,1.2127582164369164]
[null,2016,9,1.3333333333333333,1.3333333333333333,8.9,1.348314606741573,1.348314606741573,8.6,1.3953488372093024,1.3953488372093024,null,null,null,9,3,1.3333333333333333,1.3333333333333333,1.1723329425556859,8.9,3,1.348314606741573,1.348314606741573,1.1723329425556859,8.6,2.9,1.3953488372093024,1.3953488372093024,1.2127582164369164]
[null,2017,9,1.3333333333333333,1.3333333333333333,8.9,1.348314606741573,1.348314606741573,8.6,1.3953488372093024,1.3953488372093024,null,null,null,9,3,1.3333333333333333,1.3333333333333333,1.1723329425556859,8.9,3,1.348314606741573,1.348314606741573,1.1723329425556859,8.6,2.9,1.3953488372093024,1.3953488372093024,1.2127582164369164]
[null,2018,9,1.3333333333333333,1.3333333333333333,8.9,1.348314606741573,1.348314606741573,8.6,1.3953488372093024,1.3953488372093024,null,null,null,9,3,1.3333333333333333,1.3333333333333333,1.1723329425556859,8.9,3,1.348314606741573,1.348314606741573,1.1723329425556859,8.6,2.9,1.3953488372093024,1.3953488372093024,1.2127582164369164]
[null,"ARTRM8",9,{"$f":"12/C36","v":1.3333333333333333},{"$f":"12/C36","v":1.3333333333333333},8.9,{"$f":"12/F36","v":1.348314606741573},{"$f":"12/F36","v":1.348314606741573},8.6,{"$f":"12/I36","v":1.3953488372093024},{"$f":"12/I36","v":1.3953488372093024},null,null,null,9,3,{"$f":"12/O36","v":1.3333333333333333},{"$f":"12/O36","v":1.3333333333333333},{"$f":"12/3.412/P36","v":1.1723329425556859},8.9,3,{"$f":"12/T36","v":1.348314606741573},{"$f":"12/T36","v":1.348314606741573},{"$f":"12/3.412/U36","v":1.1723329425556859},8.6,2.9,{"$f":"12/Y36","v":1.3953488372093024},{"$f":"12/Y36","v":1.3953488372093024},{"$f":"12/3.412/Z36","v":1.2127582164369164},"Federal Standard/ASHRAE 90.1-2007 (as of 1/1/2010)"]
[null,"CPS",9,{"$f":"12/C37","v":1.3333333333333333},{"$f":"12/C37","v":1.3333333333333333},8.9,1.348314606741573,1.348314606741573,8.6,1.3953488372093024,1.3953488372093024,null,null,null,9,3,1.3333333333333333,1.3333333333333333,1.1723329425556859,8.9,3,1.348314606741573,1.348314606741573,1.1723329425556859,8.6,2.9,1.3953488372093024,1.3953488372093024,1.2127582164369164,"ASHRAE 90.1--2010"]
[]
["* EER - 95db/75wb outdoor air"]
["** COP - 47db/43wb outdoor air"]

{"sheet":"Geothermal","index":13,"n_rows":37,"n_cols":161,"rows_kept":37,"cut":false,"hidden":true,"merged":[]}
[null,"GeothermalAirConditioner",null,null,null,"GeothermalAirConditioner",null,null,null,"GeothermalAirConditioner",null,null,null,"GeothermalAirConditioner",null,null,null,"GeothermalAirConditioner",null,null,null,"GeothermalAirConditioner",null,null,null,"GeothermalAirConditioner",null,null,null,"GeothermalAirConditioner",null,null,null,"GeothermalAirConditioner",null,null,null,"GeothermalAirConditioner",null,null,null,"GeothermalAirConditioner",null,null,null,"GeothermalAirConditioner",null,null,null,"GeothermalAirConditioner",null,null,null,"GeothermalAirConditioner",null,null,null,"GeothermalAirConditioner",null,null,null,"GeothermalAirConditioner",null,null,null,"GeothermalAirConditioner",null,null,null,"GeothermalAirConditioner",null,null,null,"GeothermalAirConditioner",null,null,null,"GeothermalAirConditioner",null,null,null,null,"GeothermalHeatPump",null,null,null,null,null,"GeothermalHeatPump",null,null,null,null,null,"GeothermalHeatPump",null,null,null,null,null,"GeothermalHeatPump",null,null,null,null,null,"GeothermalHeatPump",null,null,null,null,null,"GeothermalHeatPump",null,null,null,null,null,"GeothermalHeatPump",null,null,null,null,null,"GeothermalHeatPump",null,null,null,null,null,"GeothermalHeatPump",null,null,null,null,null,"GeothermalHeatPump",null,null,null,null,null,"GeothermalHeatPump",null,null,null,null,null,"GeothermalHeatPump",null,null,null,null,null,"GeothermalHeatPump"]
[null,"WaterCooled",null,null,null,"WaterCooled",null,null,null,"WaterCooled",null,null,null,"WaterCooled",null,null,null,"WaterCooled",null,null,null,"WaterCooled",null,null,null,"WaterCooled",null,null,null,"WaterCooled",null,null,null,"WaterCooled",null,null,null,"WaterCooled",null,null,null,"EvaporativelyCooled",null,null,null,"EvaporativelyCooled",null,null,null,"EvaporativelyCooled",null,null,null,"EvaporativelyCooled",null,null,null,"EvaporativelyCooled",null,null,null,"EvaporativelyCooled",null,null,null,"EvaporativelyCooled",null,null,null,"EvaporativelyCooled",null,null,null,"EvaporativelyCooled",null,null,null,"EvaporativelyCooled",null,null,null,null,"WatertoAirWaterLoop",null,null,null,null,null,"WatertoAirWaterLoop",null,null,null,null,null,"WatertoAirWaterLoop",null,null,null,null,null,"WatertoAirGroundWater",null,null,null,null,null,"WatertoAirGroundWater",null,null,null,null,null,"BrinetoAirGroundLoop",null,null,null,null,null,"BrinetoAirGroundLoop",null,null,null,null,null,"WatertoWaterWaterLoop",null,null,null,null,null,"WatertoWaterWaterLoop",null,null,null,null,null,"WatertoWaterGroundWater",null,null,null,null,null,"WatertoWaterGroundWater",null,null,null,null,null,"BrinetoWaterGroundLoop",null,null,null,null,null,"BrinetoWaterGroundLoop"]
[null,"ElecResorNone",null,null,null,"Other",null,null,null,"ElecResorNone",null,null,null,"Other",null,null,null,"ElecResorNone",null,null,null,"Other",null,null,null,"ElecResorNone",null,null,null,"Other",null,null,null,"ElecResorNone",null,null,null,"Other",null,null,null,"ElecResorNone",null,null,null,"Other",null,null,null,"ElecResorNone",null,null,null,"Other",null,null,null,"ElecResorNone",null,null,null,"Other",null,null,null,"ElecResorNone",null,null,null,"Other",null,null,null,"ElecResorNone",null,null,null,"Other"]
[null,"Lessthan65kbtuh",null,null,null,"Lessthan65kbtuh",null,null,null,"65to135kbtuh",null,null,null,"65to135kbtuh",null,null,null,"135to240kbtuh",null,null,null,"135to240kbtuh",null,null,null,"240to760kbtuh",null,null,null,"240to760kbtuh",null,null,null,"Greaterthan760kbtuh",null,null,null,"Greaterthan760kbtuh",null,null,null,"Lessthan65kbtuh",null,null,null,"Lessthan65kbtuh",null,null,null,"65to135kbtuh",null,null,null,"65to135kbtuh",null,null,null,"135to240kbtuh",null,null,null,"135to240kbtuh",null,null,null,"240to760kbtuh",null,null,null,"240to760kbtuh",null,null,null,"Greaterthan760kbtuh",null,null,null,"Greaterthan760kbtuh",null,null,null,null,"Lessthan17kbtuh",null,null,null,null,null,"17to65kbtuh",null,null,null,null,null,"65to135kbtuh",null,null,null,null,null,"Lessthan65kbtuh",null,null,null,null,null,"65to135kbtuh",null,null,null,null,null,"Lessthan65kbtuh",null,null,null,null,null,"65to135kbtuh",null,null,null,null,null,"Lessthan65kbtuh",null,null,null,null,null,"65to135kbtuh",null,null,null,null,null,"Lessthan65kbtuh",null,null,null,null,null,"65to135kbtuh",null,null,null,null,null,"Lessthan65kbtuh",null,null,null,null,null,"65to135kbtuh"]
[null,{"$f":"B1&B2&B3&B4","v":"GeothermalAirConditionerWaterCooledElecResorNoneLessthan65kbtuh"},null,null,null,{"$f":"F1&F2&F3&F4","v":"GeothermalAirConditionerWaterCooledOtherLessthan65kbtuh"},null,null,null,{"$f":"J1&J2&J3&J4","v":"GeothermalAirConditionerWaterCooledElecResorNone65to135kbtuh"},null,null,null,{"$f":"N1&N2&N3&N4","v":"GeothermalAirConditionerWaterCooledOther65to135kbtuh"},null,null,null,{"$f":"R1&R2&R3&R4","v":"GeothermalAirConditionerWaterCooledElecResorNone135to240kbtuh"},null,null,null,{"$f":"V1&V2&V3&V4","v":"GeothermalAirConditionerWaterCooledOther135to240kbtuh"},null,null,null,{"$f":"Z1&Z2&Z3&Z4","v":"GeothermalAirConditionerWaterCooledElecResorNone240to760kbtuh"},null,null,null,{"$f":"AD1&AD2&AD3&AD4","v":"GeothermalAirConditionerWaterCooledOther240to760kbtuh"},null,null,null,{"$f":"AH1&AH2&AH3&AH4","v":"GeothermalAirConditionerWaterCooledElecResorNoneGreaterthan760kbtuh"},null,null,null,{"$f":"AL1&AL2&AL3&AL4","v":"GeothermalAirConditionerWaterCooledOtherGreaterthan760kbtuh"},null,null,null,{"$f":"AP1&AP2&AP3&AP4","v":"GeothermalAirConditionerEvaporativelyCooledElecResorNoneLessthan65kbtuh"},null,null,null,{"$f":"AT1&AT2&AT3&AT4","v":"GeothermalAirConditionerEvaporativelyCooledOtherLessthan65kbtuh"},null,null,null,{"$f":"AX1&AX2&AX3&AX4","v":"GeothermalAirConditionerEvaporativelyCooledElecResorNone65to135kbtuh"},null,null,null,{"$f":"BB1&BB2&BB3&BB4","v":"GeothermalAirConditionerEvaporativelyCooledOther65to135kbtuh"},null,null,null,{"$f":"BF1&BF2&BF3&BF4","v":"GeothermalAirConditionerEvaporativelyCooledElecResorNone135to240kbtuh"},null,null,null,{"$f":"BJ1&BJ2&BJ3&BJ4","v":"GeothermalAirConditionerEvaporativelyCooledOther135to240kbtuh"},null,null,null,{"$f":"BN1&BN2&BN3&BN4","v":"GeothermalAirConditionerEvaporativelyCooledElecResorNone240to760kbtuh"},null,null,null,{"$f":"BR1&BR2&BR3&BR4","v":"GeothermalAirConditionerEvaporativelyCooledOther240to760kbtuh"},null,null,null,{"$f":"BV1&BV2&BV3&BV4","v":"GeothermalAirConditionerEvaporativelyCooledElecResorNoneGreaterthan760kbtuh"},null,null,null,{"$f":"BZ1&BZ2&BZ3&BZ4","v":"GeothermalAirConditionerEvaporativelyCooledOtherGreaterthan760kbtuh"},null,null,null,null,{"$f":"CE1&CE2&CE3&CE4","v":"GeothermalHeatPumpWatertoAirWaterLoopLessthan17kbtuh"},null,null,null,null,null,{"$f":"CK1&CK2&CK3&CK4","v":"GeothermalHeatPumpWatertoAirWaterLoop17to65kbtuh"},null,null,null,null,null,{"$f":"CQ1&CQ2&CQ3&CQ4","v":"GeothermalHeatPumpWatertoAirWaterLoop65to135kbtuh"},null,null,null,null,null,{"$f":"CW1&CW2&CW3&CW4","v":"GeothermalHeatPumpWatertoAirGroundWaterLessthan65kbtuh"},null,null,null,null,null,{"$f":"DC1&DC2&DC3&DC4","v":"GeothermalHeatPumpWatertoAirGroundWater65to135kbtuh"},null,null,null,null,null,{"$f":"DI1&DI2&DI3&DI4","v":"GeothermalHeatPumpBrinetoAirGroundLoopLessthan65kbtuh"},null,null,null,null,null,{"$f":"DO1&DO2&DO3&DO4","v":"GeothermalHeatPumpBrinetoAirGroundLoop65to135kbtuh"},null,null,null,null,null,{"$f":"DU1&DU2&DU3&DU4","v":"GeothermalHeatPumpWatertoWaterWaterLoopLessthan65kbtuh"},null,null,null,null,null,{"$f":"EA1&EA2&EA3&EA4","v":"GeothermalHeatPumpWatertoWaterWaterLoop65to135kbtuh"},null,null,null,null,null,{"$f":"EG1&EG2&EG3&EG4","v":"GeothermalHeatPumpWatertoWaterGroundWaterLessthan65kbtuh"},null,null,null,null,null,{"$f":"EM1&EM2&EM3&EM4","v":"GeothermalHeatPumpWatertoWaterGroundWater65to135kbtuh"},null,null,null,null,null,{"$f":"ES1&ES2&ES3&ES4","v":"GeothermalHeatPumpBrinetoWaterGroundLoopLessthan65kbtuh"},null,null,null,null,null,{"$f":"EY1&EY2&EY3&EY4","v":"GeothermalHeatPumpBrinetoWaterGroundLoop65to135kbtuh"}]
["Manuf. Year","EER","SEER","Full Load","Part Load","EER","SEER","Full Load","Part Load","EER","IEER","Full Load","Part Load","EER","IEER","Full Load","Part Load","EER","SEER","Full Load","Part Load","EER","SEER","Full Load","Part Load","EER","IEER","Full Load","Part Load","EER","IEER","Full Load","Part Load","EER","IEER","Full Load","Part Load","EER","IEER","Full Load","Part Load","EER","SEER","Full Load","Part Load","EER","SEER","Full Load","Part Load","EER","IEER","Full Load","Part Load","EER","IEER","Full Load","Part Load","EER","SEER","Full Load","Part Load","EER","SEER","Full Load","Part Load","EER","IEER","Full Load","Part Load","EER","IEER","Full Load","Part Load","EER","IEER","Full Load","Part Load","EER","IEER","Full Load","Part Load",null,"EER","IEER","COP","Full Load","Part-:Load","Heating","EER","IEER","COP","Full Load","Part-:Load","Heating","EER","IEER","COP","Full Load","Part-:Load","Heating","EER","IEER","COP","Full Load","Part-:Load","Heating","EER","IEER","COP","Full Load","Part-:Load","Heating","EER","IEER","COP","Full Load","Part-:Load","Heating","EER","IEER","COP","Full Load","Part-:Load","Heating","EER","IEER","COP","Full Load","Part-:Load","Heating","EER","IEER","COP","Full Load","Part-:Load","Heating","EER","IEER","COP","Full Load","Part-:Load","Heating","EER","IEER","COP","Full Load","Part-:Load","Heating","EER","IEER","COP","Full Load","Part-:Load","Heating","EER","IEER","COP","Full Load","Part-:Load","Heating"]
[1990,{"$f":"B$37","v":12.1},{"$f":"C$37","v":12.3},{"$f":"12/B7","v":0.99173553719008267},{"$f":"12/C7","v":0.97560975609756095},{"$f":"F$37","v":12.1},{"$f":"G$37","v":12.3},{"$f":"12/F7","v":0.99173553719008267},{"$f":"12/G7","v":0.97560975609756095},{"$f":"J$37","v":12.1},{"$f":"K$37","v":13.9},{"$f":"12/J7","v":0.99173553719008267},{"$f":"12/K7","v":0.86330935251798557},{"$f":"N$37","v":11.9},{"$f":"O$37","v":13.7},{"$f":"12/N7","v":1.0084033613445378},{"$f":"12/O7","v":0.87591240875912413},{"$f":"R$37","v":12.5},{"$f":"S$37","v":13.9},{"$f":"12/R7","v":0.96},{"$f":"12/S7","v":0.86330935251798557},{"$f":"V$37","v":12.3},{"$f":"W$37","v":13.7},{"$f":"12/V7","v":0.97560975609756095},{"$f":"12/W7","v":0.87591240875912413},{"$f":"Z$37","v":12.4},{"$f":"AA$37","v":13.6},{"$f":"12/Z7","v":0.96774193548387089},{"$f":"12/AA7","v":0.88235294117647056},{"$f":"AD$37","v":12.2},{"$f":"AE$37","v":13.4},{"$f":"12/AD7","v":0.98360655737704927},{"$f":"12/AE7","v":0.89552238805970152},{"$f":"AH$37","v":12.2},{"$f":"AI$37","v":13.5},{"$f":"12/AH7","v":0.98360655737704927},{"$f":"12/AI7","v":0.88888888888888884},{"$f":"AL$37","v":12},{"$f":"AM$37","v":13.3},{"$f":"12/AL7","v":1},{"$f":"12/AM7","v":0.90225563909774431},{"$f":"AP$37","v":12.1},{"$f":"AQ$37","v":12.3},{"$f":"12/AP7","v":0.99173553719008267},{"$f":"12/AQ7","v":0.97560975609756095},{"$f":"AT$37","v":12.1},{"$f":"AU$37","v":12.3},{"$f":"12/AT7","v":0.99173553719008267},{"$f":"12/AU7","v":0.97560975609756095},{"$f":"AX$37","v":12.1},{"$f":"AY$37","v":12.3},{"$f":"12/AX7","v":0.99173553719008267},{"$f":"12/AY7","v":0.97560975609756095},{"$f":"BB$37","v":11.9},{"$f":"BC$37","v":12.1},{"$f":"12/BB7","v":1.0084033613445378},{"$f":"12/BC7","v":0.99173553719008267},{"$f":"BF$37","v":12},{"$f":"BG$37","v":12.2},{"$f":"12/BF7","v":1},{"$f":"12/BG7","v":0.98360655737704927},{"$f":"BJ$37","v":11.8},{"$f":"BK$37","v":12},{"$f":"12/BJ7","v":1.0169491525423728},{"$f":"12/BK7","v":1},{"$f":"BN$37","v":11.9},{"$f":"BO$37","v":12.1},{"$f":"12/BN7","v":1.0084033613445378},{"$f":"12/BO7","v":0.99173553719008267},{"$f":"BR$37","v":11.7},{"$f":"BS$37","v":11.9},{"$f":"12/BR7","v":1.0256410256410258},{"$f":"12/BS7","v":1.0084033613445378},{"$f":"BV$37","v":11.7},{"$f":"BW$37","v":11.9},{"$f":"12/BV7","v":1.0256410256410258},{"$f":"12/BW7","v":1.0084033613445378},{"$f":"BZ$37","v":11.5},{"$f":"CA$37","v":11.7},{"$f":"12/BZ7","v":1.0434782608695652},{"$f":"12/CA7","v":1.0256410256410258},null,{"$f":"CE$37","v":12.2},{"$f":"CE7","v":12.2},{"$f":"CG$37","v":4.3},{"$f":"12/CE7","v":0.98360655737704927},{"$f":"12/CF7","v":0.98360655737704927},{"$f":"12/3.412/CG7","v":0.8179067041086181},{"$f":"CK$37","v":13},{"$f":"CK7","v":13},{"$f":"CM$37","v":4.3},{"$f":"12/CK7","v":0.92307692307692313},{"$f":"12/CL7","v":0.92307692307692313},{"$f":"12/3.412/CM7","v":0.8179067041086181},{"$f":"CQ$37","v":13},{"$f":"CQ7","v":13},{"$f":"CS$37","v":4.3},{"$f":"12/CQ7","v":0.92307692307692313},{"$f":"12/CR7","v":0.92307692307692313},{"$f":"12/3.412/CS7","v":0.8179067041086181},{"$f":"CW$37","v":18},{"$f":"CW7","v":18},{"$f":"CY$37","v":3.7},{"$f":"12/CW7","v":0.66666666666666663},{"$f":"12/CX7","v":0.66666666666666663},{"$f":"12/3.412/CY7","v":0.95054022369379931},{"$f":"DC$37","v":18},{"$f":"DC7","v":18},{"$f":"DE$37","v":3.7},{"$f":"12/DC7","v":0.66666666666666663},{"$f":"12/DD7","v":0.66666666666666663},{"$f":"12/3.412/DE7","v":0.95054022369379931},{"$f":"DI$37","v":14.1},{"$f":"DI7","v":14.1},{"$f":"DK$37","v":3.2},{"$f":"12/DI7","v":0.85106382978723405},{"$f":"12/DJ7","v":0.85106382978723405},{"$f":"12/3.412/DK7","v":1.0990621336459554},{"$f":"DO$37","v":14.1},{"$f":"DO7","v":14.1},{"$f":"DQ$37","v":3.2},{"$f":"12/DO7","v":0.85106382978723405},{"$f":"12/DP7","v":0.85106382978723405},{"$f":"12/3.412/DQ7","v":1.0990621336459554},{"$f":"DU$37","v":10.6},{"$f":"DU7","v":10.6},{"$f":"DW$37","v":3.7},{"$f":"12/DU7","v":1.1320754716981132},{"$f":"12/DV7","v":1.1320754716981132},{"$f":"12/3.412/DW7","v":0.95054022369379931},{"$f":"EA$37","v":10.6},{"$f":"EA7","v":10.6},{"$f":"EC$37","v":3.7},{"$f":"12/EA7","v":1.1320754716981132},{"$f":"12/EB7","v":1.1320754716981132},{"$f":"12/3.412/EC7","v":0.95054022369379931},{"$f":"EG$37","v":16.3},{"$f":"EG7","v":16.3},{"$f":"EI$37","v":3.1},{"$f":"12/EG7","v":0.73619631901840488},{"$f":"12/EH7","v":0.73619631901840488},{"$f":"12/3.412/EI7","v":1.1345157508603412},{"$f":"EM$37","v":16.3},{"$f":"EM7","v":16.3},{"$f":"EO$37","v":3.1},{"$f":"12/EM7","v":0.73619631901840488},{"$f":"12/EN7","v":0.73619631901840488},{"$f":"12/3.412/EO7","v":1.1345157508603412},{"$f":"ES$37","v":12.1},{"$f":"ES7","v":12.1},{"$f":"EU$37","v":2.5},{"$f":"12/ES7","v":0.99173553719008267},{"$f":"12/ET7","v":0.99173553719008267},{"$f":"12/3.412/EU7","v":1.4067995310668231},{"$f":"EY$37","v":12.1},{"$f":"EY7","v":12.1},{"$f":"FA$37","v":2.5},{"$f":"12/EY7","v":0.99173553719008267},{"$f":"12/EZ7","v":0.99173553719008267},{"$f":"12/3.412/FA7","v":1.4067995310668231}]
[1991,{"$f":"B$37","v":12.1},12.3,{"$f":"12/B8","v":0.99173553719008267},0.97560975609756095,{"$f":"F$37","v":12.1},12.3,0.99173553719008267,0.97560975609756095,{"$f":"J$37","v":12.1},13.9,0.99173553719008267,0.86330935251798557,{"$f":"N$37","v":11.9},13.7,1.0084033613445378,0.87591240875912413,{"$f":"R$37","v":12.5},13.9,0.96,0.86330935251798557,{"$f":"V$37","v":12.3},13.7,0.97560975609756095,0.87591240875912413,{"$f":"Z$37","v":12.4},13.6,0.96774193548387089,0.88235294117647056,{"$f":"AD$37","v":12.2},13.4,0.98360655737704927,0.89552238805970152,{"$f":"AH$37","v":12.2},13.5,0.98360655737704927,0.88888888888888884,{"$f":"AL$37","v":12},13.3,1,0.90225563909774431,{"$f":"AP$37","v":12.1},12.3,0.99173553719008267,0.97560975609756095,{"$f":"AT$37","v":12.1},12.3,0.99173553719008267,0.97560975609756095,{"$f":"AX$37","v":12.1},12.3,0.99173553719008267,0.97560975609756095,{"$f":"BB$37","v":11.9},12.1,1.0084033613445378,0.99173553719008267,{"$f":"BF$37","v":12},12.2,1,0.98360655737704927,{"$f":"BJ$37","v":11.8},12,1.0169491525423728,1,{"$f":"BN$37","v":11.9},12.1,1.0084033613445378,0.99173553719008267,{"$f":"BR$37","v":11.7},11.9,1.0256410256410258,1.0084033613445378,{"$f":"BV$37","v":11.7},11.9,1.0256410256410258,1.0084033613445378,{"$f":"BZ$37","v":11.5},11.7,1.0434782608695652,1.0256410256410258,null,{"$f":"CE$37","v":12.2},{"$f":"CE8","v":12.2},4.3,{"$f":"12/CE8","v":0.98360655737704927},{"$f":"12/CF8","v":0.98360655737704927},0.8179067041086181,{"$f":"CK$37","v":13},{"$f":"CK8","v":13},4.3,{"$f":"12/CK8","v":0.92307692307692313},{"$f":"12/CL8","v":0.92307692307692313},0.8179067041086181,{"$f":"CQ$37","v":13},{"$f":"CQ8","v":13},{"$f":"CS$37","v":4.3},{"$f":"12/CQ8","v":0.92307692307692313},{"$f":"12/CR8","v":0.92307692307692313},0.8179067041086181,{"$f":"CW$37","v":18},{"$f":"CW8","v":18},{"$f":"CY$37","v":3.7},{"$f":"12/CW8","v":0.66666666666666663},{"$f":"12/CX8","v":0.66666666666666663},0.95054022369379931,{"$f":"DC$37","v":18},{"$f":"DC8","v":18},{"$f":"DE$37","v":3.7},{"$f":"12/DC8","v":0.66666666666666663},{"$f":"12/DD8","v":0.66666666666666663},0.95054022369379931,{"$f":"DI$37","v":14.1},{"$f":"DI8","v":14.1},{"$f":"DK$37","v":3.2},{"$f":"12/DI8","v":0.85106382978723405},{"$f":"12/DJ8","v":0.85106382978723405},1.0990621336459554,{"$f":"DO$37","v":14.1},{"$f":"DO8","v":14.1},{"$f":"DQ$37","v":3.2},{"$f":"12/DO8","v":0.85106382978723405},{"$f":"12/DP8","v":0.85106382978723405},1.0990621336459554,10.6,10.6,{"$f":"DW$37","v":3.7},{"$f":"12/DU8","v":1.1320754716981132},{"$f":"12/DV8","v":1.1320754716981132},0.95054022369379931,10.6,10.6,{"$f":"EC$37","v":3.7},{"$f":"12/EA8","v":1.1320754716981132},{"$f":"12/EB8","v":1.1320754716981132},0.95054022369379931,16.3,16.3,{"$f":"EI$37","v":3.1},{"$f":"12/EG8","v":0.73619631901840488},{"$f":"12/EH8","v":0.73619631901840488},1.1345157508603412,16.3,16.3,{"$f":"EO$37","v":3.1},{"$f":"12/EM8","v":0.73619631901840488},{"$f":"12/EN8","v":0.73619631901840488},1.1345157508603412,12.1,{"$f":"ES8","v":12.1},{"$f":"EU$37","v":2.5},{"$f":"12/ES8","v":0.99173553719008267},{"$f":"12/ET8","v":0.99173553719008267},1.4067995310668231,12.1,{"$f":"EY8","v":12.1},{"$f":"FA$37","v":2.5},{"$f":"12/EY8","v":0.99173553719008267},{"$f":"12/EZ8","v":0.99173553719008267},1.4067995310668231]
[1992,12.1,12.3,0.99173553719008267,0.97560975609756095,12.1,12.3,0.99173553719008267,0.97560975609756095,12.1,13.9,0.99173553719008267,0.86330935251798557,11.9,13.7,1.0084033613445378,0.87591240875912413,12.5,13.9,0.96,0.86330935251798557,12.3,13.7,0.97560975609756095,0.87591240875912413,12.4,13.6,0.96774193548387089,0.88235294117647056,12.2,13.4,0.98360655737704927,0.89552238805970152,12.2,13.5,0.98360655737704927,0.88888888888888884,12,13.3,1,0.90225563909774431,12.1,12.3,0.99173553719008267,0.97560975609756095,12.1,12.3,0.99173553719008267,0.97560975609756095,12.1,12.3,0.99173553719008267,0.97560975609756095,11.9,12.1,1.0084033613445378,0.99173553719008267,12,12.2,1,0.98360655737704927,11.8,12,1.0169491525423728,1,11.9,12.1,1.0084033613445378,0.99173553719008267,11.7,11.9,1.0256410256410258,1.0084033613445378,11.7,11.9,1.0256410256410258,1.0084033613445378,11.5,11.7,1.0434782608695652,1.0256410256410258,null,12.2,12.2,4.3,0.98360655737704927,0.98360655737704927,0.8179067041086181,13,13,4.3,0.92307692307692313,0.92307692307692313,0.8179067041086181,13,13,4.3,0.92307692307692313,0.92307692307692313,0.8179067041086181,18,18,3.7,0.66666666666666663,0.66666666666666663,0.95054022369379931,18,18,3.7,0.66666666666666663,0.66666666666666663,0.95054022369379931,14.1,14.1,3.2,0.85106382978723405,0.85106382978723405,1.0990621336459554,14.1,14.1,3.2,0.85106382978723405,0.85106382978723405,1.0990621336459554,10.6,10.6,3.7,1.1320754716981132,1.1320754716981132,0.95054022369379931,10.6,10.6,3.7,1.1320754716981132,1.1320754716981132,0.95054022369379931,16.3,16.3,3.1,0.73619631901840488,0.73619631901840488,1.1345157508603412,16.3,16.3,3.1,0.73619631901840488,0.73619631901840488,1.1345157508603412,12.1,12.1,2.5,0.99173553719008267,0.99173553719008267,1.4067995310668231,12.1,12.1,2.5,0.99173553719008267,0.99173553719008267,1.4067995310668231]
[1993,12.1,12.3,0.99173553719008267,0.97560975609756095,12.1,12.3,0.99173553719008267,0.97560975609756095,12.1,13.9,0.99173553719008267,0.86330935251798557,11.9,13.7,1.0084033613445378,0.87591240875912413,12.5,13.9,0.96,0.86330935251798557,12.3,13.7,0.97560975609756095,0.87591240875912413,12.4,13.6,0.96774193548387089,0.88235294117647056,12.2,13.4,0.98360655737704927,0.89552238805970152,12.2,13.5,0.98360655737704927,0.88888888888888884,12,13.3,1,0.90225563909774431,12.1,12.3,0.99173553719008267,0.97560975609756095,12.1,12.3,0.99173553719008267,0.97560975609756095,12.1,12.3,0.99173553719008267,0.97560975609756095,11.9,12.1,1.0084033613445378,0.99173553719008267,12,12.2,1,0.98360655737704927,11.8,12,1.0169491525423728,1,11.9,12.1,1.0084033613445378,0.99173553719008267,11.7,11.9,1.0256410256410258,1.0084033613445378,11.7,11.9,1.0256410256410258,1.0084033613445378,11.5,11.7,1.0434782608695652,1.0256410256410258,null,12.2,12.2,4.3,0.98360655737704927,0.98360655737704927,0.8179067041086181,13,13,4.3,0.92307692307692313,0.92307692307692313,0.8179067041086181,13,13,4.3,0.92307692307692313,0.92307692307692313,0.8179067041086181,18,18,3.7,0.66666666666666663,0.66666666666666663,0.95054022369379931,18,18,3.7,0.66666666666666663,0.66666666666666663,0.95054022369379931,14.1,14.1,3.2,0.85106382978723405,0.85106382978723405,1.0990621336459554,14.1,14.1,3.2,0.85106382978723405,0.85106382978723405,1.0990621336459554,10.6,10.6,3.7,1.1320754716981132,1.1320754716981132,0.95054022369379931,10.6,10.6,3.7,1.1320754716981132,1.1320754716981132,0.95054022369379931,16.3,16.3,3.1,0.73619631901840488,0.73619631901840488,1.1345157508603412,16.3,16.3,3.1,0.73619631901840488,0.73619631901840488,1.1345157508603412,12.1,12.1,2.5,0.99173553719008267,0.99173553719008267,1.4067995310668231,12.1,12.1,2.5,0.99173553719008267,0.99173553719008267,1.4067995310668231]
[1994,12.1,12.3,0.99173553719008267,0.97560975609756095,12.1,12.3,0.99173553719008267,0.97560975609756095,12.1,13.9,0.99173553719008267,0.86330935251798557,11.9,13.7,1.0084033613445378,0.87591240875912413,12.5,13.9,0.96,0.86330935251798557,12.3,13.7,0.97560975609756095,0.87591240875912413,12.4,13.6,0.96774193548387089,0.88235294117647056,12.2,13.4,0.98360655737704927,0.89552238805970152,12.2,13.5,0.98360655737704927,0.88888888888888884,12,13.3,1,0.90225563909774431,12.1,12.3,0.99173553719008267,0.97560975609756095,12.1,12.3,0.99173553719008267,0.97560975609756095,12.1,12.3,0.99173553719008267,0.97560975609756095,11.9,12.1,1.0084033613445378,0.99173553719008267,12,12.2,1,0.98360655737704927,11.8,12,1.0169491525423728,1,11.9,12.1,1.0084033613445378,0.99173553719008267,11.7,11.9,1.0256410256410258,1.0084033613445378,11.7,11.9,1.0256410256410258,1.0084033613445378,11.5,11.7,1.0434782608695652,1.0256410256410258,null,12.2,12.2,4.3,0.98360655737704927,0.98360655737704927,0.8179067041086181,13,13,4.3,0.92307692307692313,0.92307692307692313,0.8179067041086181,13,13,4.3,0.92307692307692313,0.92307692307692313,0.8179067041086181,18,18,3.7,0.66666666666666663,0.66666666666666663,0.95054022369379931,18,18,3.7,0.66666666666666663,0.66666666666666663,0.95054022369379931,14.1,14.1,3.2,0.85106382978723405,0.85106382978723405,1.0990621336459554,14.1,14.1,3.2,0.85106382978723405,0.85106382978723405,1.0990621336459554,10.6,10.6,3.7,1.1320754716981132,1.1320754716981132,0.95054022369379931,10.6,10.6,3.7,1.1320754716981132,1.1320754716981132,0.95054022369379931,16.3,16.3,3.1,0.73619631901840488,0.73619631901840488,1.1345157508603412,16.3,16.3,3.1,0.73619631901840488,0.73619631901840488,1.1345157508603412,12.1,12.1,2.5,0.99173553719008267,0.99173553719008267,1.4067995310668231,12.1,12.1,2.5,0.99173553719008267,0.99173553719008267,1.4067995310668231]
[1995,12.1,12.3,0.99173553719008267,0.97560975609756095,12.1,12.3,0.99173553719008267,0.97560975609756095,12.1,13.9,0.99173553719008267,0.86330935251798557,11.9,13.7,1.0084033613445378,0.87591240875912413,12.5,13.9,0.96,0.86330935251798557,12.3,13.7,0.97560975609756095,0.87591240875912413,12.4,13.6,0.96774193548387089,0.88235294117647056,12.2,13.4,0.98360655737704927,0.89552238805970152,12.2,13.5,0.98360655737704927,0.88888888888888884,12,13.3,1,0.90225563909774431,12.1,12.3,0.99173553719008267,0.97560975609756095,12.1,12.3,0.99173553719008267,0.97560975609756095,12.1,12.3,0.99173553719008267,0.97560975609756095,11.9,12.1,1.0084033613445378,0.99173553719008267,12,12.2,1,0.98360655737704927,11.8,12,1.0169491525423728,1,11.9,12.1,1.0084033613445378,0.99173553719008267,11.7,11.9,1.0256410256410258,1.0084033613445378,11.7,11.9,1.0256410256410258,1.0084033613445378,11.5,11.7,1.0434782608695652,1.0256410256410258,null,12.2,12.2,4.3,0.98360655737704927,0.98360655737704927,0.8179067041086181,13,13,4.3,0.92307692307692313,0.92307692307692313,0.8179067041086181,13,13,4.3,0.92307692307692313,0.92307692307692313,0.8179067041086181,18,18,3.7,0.66666666666666663,0.66666666666666663,0.95054022369379931,18,18,3.7,0.66666666666666663,0.66666666666666663,0.95054022369379931,14.1,14.1,3.2,0.85106382978723405,0.85106382978723405,1.0990621336459554,14.1,14.1,3.2,0.85106382978723405,0.85106382978723405,1.0990621336459554,10.6,10.6,3.7,1.1320754716981132,1.1320754716981132,0.95054022369379931,10.6,10.6,3.7,1.1320754716981132,1.1320754716981132,0.95054022369379931,16.3,16.3,3.1,0.73619631901840488,0.73619631901840488,1.1345157508603412,16.3,16.3,3.1,0.73619631901840488,0.73619631901840488,1.1345157508603412,12.1,12.1,2.5,0.99173553719008267,0.99173553719008267,1.4067995310668231,12.1,12.1,2.5,0.99173553719008267,0.99173553719008267,1.4067995310668231]
[1996,12.1,12.3,0.99173553719008267,0.97560975609756095,12.1,12.3,0.99173553719008267,0.97560975609756095,12.1,13.9,0.99173553719008267,0.86330935251798557,11.9,13.7,1.0084033613445378,0.87591240875912413,12.5,13.9,0.96,0.86330935251798557,12.3,13.7,0.97560975609756095,0.87591240875912413,12.4,13.6,0.96774193548387089,0.88235294117647056,12.2,13.4,0.98360655737704927,0.89552238805970152,12.2,13.5,0.98360655737704927,0.88888888888888884,12,13.3,1,0.90225563909774431,12.1,12.3,0.99173553719008267,0.97560975609756095,12.1,12.3,0.99173553719008267,0.97560975609756095,12.1,12.3,0.99173553719008267,0.97560975609756095,11.9,12.1,1.0084033613445378,0.99173553719008267,12,12.2,1,0.98360655737704927,11.8,12,1.0169491525423728,1,11.9,12.1,1.0084033613445378,0.99173553719008267,11.7,11.9,1.0256410256410258,1.0084033613445378,11.7,11.9,1.0256410256410258,1.0084033613445378,11.5,11.7,1.0434782608695652,1.0256410256410258,null,12.2,12.2,4.3,0.98360655737704927,0.98360655737704927,0.8179067041086181,13,13,4.3,0.92307692307692313,0.92307692307692313,0.8179067041086181,13,13,4.3,0.92307692307692313,0.92307692307692313,0.8179067041086181,18,18,3.7,0.66666666666666663,0.66666666666666663,0.95054022369379931,18,18,3.7,0.66666666666666663,0.66666666666666663,0.95054022369379931,14.1,14.1,3.2,0.85106382978723405,0.85106382978723405,1.0990621336459554,14.1,14.1,3.2,0.85106382978723405,0.85106382978723405,1.0990621336459554,10.6,10.6,3.7,1.1320754716981132,1.1320754716981132,0.95054022369379931,10.6,10.6,3.7,1.1320754716981132,1.1320754716981132,0.95054022369379931,16.3,16.3,3.1,0.73619631901840488,0.73619631901840488,1.1345157508603412,16.3,16.3,3.1,0.73619631901840488,0.73619631901840488,1.1345157508603412,12.1,12.1,2.5,0.99173553719008267,0.99173553719008267,1.4067995310668231,12.1,12.1,2.5,0.99173553719008267,0.99173553719008267,1.4067995310668231]
[1997,12.1,12.3,0.99173553719008267,0.97560975609756095,12.1,12.3,0.99173553719008267,0.97560975609756095,12.1,13.9,0.99173553719008267,0.86330935251798557,11.9,13.7,1.0084033613445378,0.87591240875912413,12.5,13.9,0.96,0.86330935251798557,12.3,13.7,0.97560975609756095,0.87591240875912413,12.4,13.6,0.96774193548387089,0.88235294117647056,12.2,13.4,0.98360655737704927,0.89552238805970152,12.2,13.5,0.98360655737704927,0.88888888888888884,12,13.3,1,0.90225563909774431,12.1,12.3,0.99173553719008267,0.97560975609756095,12.1,12.3,0.99173553719008267,0.97560975609756095,12.1,12.3,0.99173553719008267,0.97560975609756095,11.9,12.1,1.0084033613445378,0.99173553719008267,12,12.2,1,0.98360655737704927,11.8,12,1.0169491525423728,1,11.9,12.1,1.0084033613445378,0.99173553719008267,11.7,11.9,1.0256410256410258,1.0084033613445378,11.7,11.9,1.0256410256410258,1.0084033613445378,11.5,11.7,1.0434782608695652,1.0256410256410258,null,12.2,12.2,4.3,0.98360655737704927,0.98360655737704927,0.8179067041086181,13,13,4.3,0.92307692307692313,0.92307692307692313,0.8179067041086181,13,13,4.3,0.92307692307692313,0.92307692307692313,0.8179067041086181,18,18,3.7,0.66666666666666663,0.66666666666666663,0.95054022369379931,18,18,3.7,0.66666666666666663,0.66666666666666663,0.95054022369379931,14.1,14.1,3.2,0.85106382978723405,0.85106382978723405,1.0990621336459554,14.1,14.1,3.2,0.85106382978723405,0.85106382978723405,1.0990621336459554,10.6,10.6,3.7,1.1320754716981132,1.1320754716981132,0.95054022369379931,10.6,10.6,3.7,1.1320754716981132,1.1320754716981132,0.95054022369379931,16.3,16.3,3.1,0.73619631901840488,0.73619631901840488,1.1345157508603412,16.3,16.3,3.1,0.73619631901840488,0.73619631901840488,1.1345157508603412,12.1,12.1,2.5,0.99173553719008267,0.99173553719008267,1.4067995310668231,12.1,12.1,2.5,0.99173553719008267,0.99173553719008267,1.4067995310668231]
[1998,12.1,12.3,0.99173553719008267,0.97560975609756095,12.1,12.3,0.99173553719008267,0.97560975609756095,12.1,13.9,0.99173553719008267,0.86330935251798557,11.9,13.7,1.0084033613445378,0.87591240875912413,12.5,13.9,0.96,0.86330935251798557,12.3,13.7,0.97560975609756095,0.87591240875912413,12.4,13.6,0.96774193548387089,0.88235294117647056,12.2,13.4,0.98360655737704927,0.89552238805970152,12.2,13.5,0.98360655737704927,0.88888888888888884,12,13.3,1,0.90225563909774431,12.1,12.3,0.99173553719008267,0.97560975609756095,12.1,12.3,0.99173553719008267,0.97560975609756095,12.1,12.3,0.99173553719008267,0.97560975609756095,11.9,12.1,1.0084033613445378,0.99173553719008267,12,12.2,1,0.98360655737704927,11.8,12,1.0169491525423728,1,11.9,12.1,1.0084033613445378,0.99173553719008267,11.7,11.9,1.0256410256410258,1.0084033613445378,11.7,11.9,1.0256410256410258,1.0084033613445378,11.5,11.7,1.0434782608695652,1.0256410256410258,null,12.2,12.2,4.3,0.98360655737704927,0.98360655737704927,0.8179067041086181,13,13,4.3,0.92307692307692313,0.92307692307692313,0.8179067041086181,13,13,4.3,0.92307692307692313,0.92307692307692313,0.8179067041086181,18,18,3.7,0.66666666666666663,0.66666666666666663,0.95054022369379931,18,18,3.7,0.66666666666666663,0.66666666666666663,0.95054022369379931,14.1,14.1,3.2,0.85106382978723405,0.85106382978723405,1.0990621336459554,14.1,14.1,3.2,0.85106382978723405,0.85106382978723405,1.0990621336459554,10.6,10.6,3.7,1.1320754716981132,1.1320754716981132,0.95054022369379931,10.6,10.6,3.7,1.1320754716981132,1.1320754716981132,0.95054022369379931,16.3,16.3,3.1,0.73619631901840488,0.73619631901840488,1.1345157508603412,16.3,16.3,3.1,0.73619631901840488,0.73619631901840488,1.1345157508603412,12.1,12.1,2.5,0.99173553719008267,0.99173553719008267,1.4067995310668231,12.1,12.1,2.5,0.99173553719008267,0.99173553719008267,1.4067995310668231]
[1999,12.1,12.3,0.99173553719008267,0.97560975609756095,12.1,12.3,0.99173553719008267,0.97560975609756095,12.1,13.9,0.99173553719008267,0.86330935251798557,11.9,13.7,1.0084033613445378,0.87591240875912413,12.5,13.9,0.96,0.86330935251798557,12.3,13.7,0.97560975609756095,0.87591240875912413,12.4,13.6,0.96774193548387089,0.88235294117647056,12.2,13.4,0.98360655737704927,0.89552238805970152,12.2,13.5,0.98360655737704927,0.88888888888888884,12,13.3,1,0.90225563909774431,12.1,12.3,0.99173553719008267,0.97560975609756095,12.1,12.3,0.99173553719008267,0.97560975609756095,12.1,12.3,0.99173553719008267,0.97560975609756095,11.9,12.1,1.0084033613445378,0.99173553719008267,12,12.2,1,0.98360655737704927,11.8,12,1.0169491525423728,1,11.9,12.1,1.0084033613445378,0.99173553719008267,11.7,11.9,1.0256410256410258,1.0084033613445378,11.7,11.9,1.0256410256410258,1.0084033613445378,11.5,11.7,1.0434782608695652,1.0256410256410258,null,12.2,12.2,4.3,0.98360655737704927,0.98360655737704927,0.8179067041086181,13,13,4.3,0.92307692307692313,0.92307692307692313,0.8179067041086181,13,13,4.3,0.92307692307692313,0.92307692307692313,0.8179067041086181,18,18,3.7,0.66666666666666663,0.66666666666666663,0.95054022369379931,18,18,3.7,0.66666666666666663,0.66666666666666663,0.95054022369379931,14.1,14.1,3.2,0.85106382978723405,0.85106382978723405,1.0990621336459554,14.1,14.1,3.2,0.85106382978723405,0.85106382978723405,1.0990621336459554,10.6,10.6,3.7,1.1320754716981132,1.1320754716981132,0.95054022369379931,10.6,10.6,3.7,1.1320754716981132,1.1320754716981132,0.95054022369379931,16.3,16.3,3.1,0.73619631901840488,0.73619631901840488,1.1345157508603412,16.3,16.3,3.1,0.73619631901840488,0.73619631901840488,1.1345157508603412,12.1,12.1,2.5,0.99173553719008267,0.99173553719008267,1.4067995310668231,12.1,12.1,2.5,0.99173553719008267,0.99173553719008267,1.4067995310668231]
[2000,12.1,12.3,0.99173553719008267,0.97560975609756095,12.1,12.3,0.99173553719008267,0.97560975609756095,12.1,13.9,0.99173553719008267,0.86330935251798557,11.9,13.7,1.0084033613445378,0.87591240875912413,12.5,13.9,0.96,0.86330935251798557,12.3,13.7,0.97560975609756095,0.87591240875912413,12.4,13.6,0.96774193548387089,0.88235294117647056,12.2,13.4,0.98360655737704927,0.89552238805970152,12.2,13.5,0.98360655737704927,0.88888888888888884,12,13.3,1,0.90225563909774431,12.1,12.3,0.99173553719008267,0.97560975609756095,12.1,12.3,0.99173553719008267,0.97560975609756095,12.1,12.3,0.99173553719008267,0.97560975609756095,11.9,12.1,1.0084033613445378,0.99173553719008267,12,12.2,1,0.98360655737704927,11.8,12,1.0169491525423728,1,11.9,12.1,1.0084033613445378,0.99173553719008267,11.7,11.9,1.0256410256410258,1.0084033613445378,11.7,11.9,1.0256410256410258,1.0084033613445378,11.5,11.7,1.0434782608695652,1.0256410256410258,null,12.2,12.2,4.3,0.98360655737704927,0.98360655737704927,0.8179067041086181,13,13,4.3,0.92307692307692313,0.92307692307692313,0.8179067041086181,13,13,4.3,0.92307692307692313,0.92307692307692313,0.8179067041086181,18,18,3.7,0.66666666666666663,0.66666666666666663,0.95054022369379931,18,18,3.7,0.66666666666666663,0.66666666666666663,0.95054022369379931,14.1,14.1,3.2,0.85106382978723405,0.85106382978723405,1.0990621336459554,14.1,14.1,3.2,0.85106382978723405,0.85106382978723405,1.0990621336459554,10.6,10.6,3.7,1.1320754716981132,1.1320754716981132,0.95054022369379931,10.6,10.6,3.7,1.1320754716981132,1.1320754716981132,0.95054022369379931,16.3,16.3,3.1,0.73619631901840488,0.73619631901840488,1.1345157508603412,16.3,16.3,3.1,0.73619631901840488,0.73619631901840488,1.1345157508603412,12.1,12.1,2.5,0.99173553719008267,0.99173553719008267,1.4067995310668231,12.1,12.1,2.5,0.99173553719008267,0.99173553719008267,1.4067995310668231]
[2001,12.1,12.3,0.99173553719008267,0.97560975609756095,12.1,12.3,0.99173553719008267,0.97560975609756095,12.1,13.9,0.99173553719008267,0.86330935251798557,11.9,13.7,1.0084033613445378,0.87591240875912413,12.5,13.9,0.96,0.86330935251798557,12.3,13.7,0.97560975609756095,0.87591240875912413,12.4,13.6,0.96774193548387089,0.88235294117647056,12.2,13.4,0.98360655737704927,0.89552238805970152,12.2,13.5,0.98360655737704927,0.88888888888888884,12,13.3,1,0.90225563909774431,12.1,12.3,0.99173553719008267,0.97560975609756095,12.1,12.3,0.99173553719008267,0.97560975609756095,12.1,12.3,0.99173553719008267,0.97560975609756095,11.9,12.1,1.0084033613445378,0.99173553719008267,12,12.2,1,0.98360655737704927,11.8,12,1.0169491525423728,1,11.9,12.1,1.0084033613445378,0.99173553719008267,11.7,11.9,1.0256410256410258,1.0084033613445378,11.7,11.9,1.0256410256410258,1.0084033613445378,11.5,11.7,1.0434782608695652,1.0256410256410258,null,12.2,12.2,4.3,0.98360655737704927,0.98360655737704927,0.8179067041086181,13,13,4.3,0.92307692307692313,0.92307692307692313,0.8179067041086181,13,13,4.3,0.92307692307692313,0.92307692307692313,0.8179067041086181,18,18,3.7,0.66666666666666663,0.66666666666666663,0.95054022369379931,18,18,3.7,0.66666666666666663,0.66666666666666663,0.95054022369379931,14.1,14.1,3.2,0.85106382978723405,0.85106382978723405,1.0990621336459554,14.1,14.1,3.2,0.85106382978723405,0.85106382978723405,1.0990621336459554,10.6,10.6,3.7,1.1320754716981132,1.1320754716981132,0.95054022369379931,10.6,10.6,3.7,1.1320754716981132,1.1320754716981132,0.95054022369379931,16.3,16.3,3.1,0.73619631901840488,0.73619631901840488,1.1345157508603412,16.3,16.3,3.1,0.73619631901840488,0.73619631901840488,1.1345157508603412,12.1,12.1,2.5,0.99173553719008267,0.99173553719008267,1.4067995310668231,12.1,12.1,2.5,0.99173553719008267,0.99173553719008267,1.4067995310668231]
[2002,12.1,12.3,0.99173553719008267,0.97560975609756095,12.1,12.3,0.99173553719008267,0.97560975609756095,12.1,13.9,0.99173553719008267,0.86330935251798557,11.9,13.7,1.0084033613445378,0.87591240875912413,12.5,13.9,0.96,0.86330935251798557,12.3,13.7,0.97560975609756095,0.87591240875912413,12.4,13.6,0.96774193548387089,0.88235294117647056,12.2,13.4,0.98360655737704927,0.89552238805970152,12.2,13.5,0.98360655737704927,0.88888888888888884,12,13.3,1,0.90225563909774431,12.1,12.3,0.99173553719008267,0.97560975609756095,12.1,12.3,0.99173553719008267,0.97560975609756095,12.1,12.3,0.99173553719008267,0.97560975609756095,11.9,12.1,1.0084033613445378,0.99173553719008267,12,12.2,1,0.98360655737704927,11.8,12,1.0169491525423728,1,11.9,12.1,1.0084033613445378,0.99173553719008267,11.7,11.9,1.0256410256410258,1.0084033613445378,11.7,11.9,1.0256410256410258,1.0084033613445378,11.5,11.7,1.0434782608695652,1.0256410256410258,null,12.2,12.2,4.3,0.98360655737704927,0.98360655737704927,0.8179067041086181,13,13,4.3,0.92307692307692313,0.92307692307692313,0.8179067041086181,13,13,4.3,0.92307692307692313,0.92307692307692313,0.8179067041086181,18,18,3.7,0.66666666666666663,0.66666666666666663,0.95054022369379931,18,18,3.7,0.66666666666666663,0.66666666666666663,0.95054022369379931,14.1,14.1,3.2,0.85106382978723405,0.85106382978723405,1.0990621336459554,14.1,14.1,3.2,0.85106382978723405,0.85106382978723405,1.0990621336459554,10.6,10.6,3.7,1.1320754716981132,1.1320754716981132,0.95054022369379931,10.6,10.6,3.7,1.1320754716981132,1.1320754716981132,0.95054022369379931,16.3,16.3,3.1,0.73619631901840488,0.73619631901840488,1.1345157508603412,16.3,16.3,3.1,0.73619631901840488,0.73619631901840488,1.1345157508603412,12.1,12.1,2.5,0.99173553719008267,0.99173553719008267,1.4067995310668231,12.1,12.1,2.5,0.99173553719008267,0.99173553719008267,1.4067995310668231]
[2003,12.1,12.3,0.99173553719008267,0.97560975609756095,12.1,12.3,0.99173553719008267,0.97560975609756095,12.1,13.9,0.99173553719008267,0.86330935251798557,11.9,13.7,1.0084033613445378,0.87591240875912413,12.5,13.9,0.96,0.86330935251798557,12.3,13.7,0.97560975609756095,0.87591240875912413,12.4,13.6,0.96774193548387089,0.88235294117647056,12.2,13.4,0.98360655737704927,0.89552238805970152,12.2,13.5,0.98360655737704927,0.88888888888888884,12,13.3,1,0.90225563909774431,12.1,12.3,0.99173553719008267,0.97560975609756095,12.1,12.3,0.99173553719008267,0.97560975609756095,12.1,12.3,0.99173553719008267,0.97560975609756095,11.9,12.1,1.0084033613445378,0.99173553719008267,12,12.2,1,0.98360655737704927,11.8,12,1.0169491525423728,1,11.9,12.1,1.0084033613445378,0.99173553719008267,11.7,11.9,1.0256410256410258,1.0084033613445378,11.7,11.9,1.0256410256410258,1.0084033613445378,11.5,11.7,1.0434782608695652,1.0256410256410258,null,12.2,12.2,4.3,0.98360655737704927,0.98360655737704927,0.8179067041086181,13,13,4.3,0.92307692307692313,0.92307692307692313,0.8179067041086181,13,13,4.3,0.92307692307692313,0.92307692307692313,0.8179067041086181,18,18,3.7,0.66666666666666663,0.66666666666666663,0.95054022369379931,18,18,3.7,0.66666666666666663,0.66666666666666663,0.95054022369379931,14.1,14.1,3.2,0.85106382978723405,0.85106382978723405,1.0990621336459554,14.1,14.1,3.2,0.85106382978723405,0.85106382978723405,1.0990621336459554,10.6,10.6,3.7,1.1320754716981132,1.1320754716981132,0.95054022369379931,10.6,10.6,3.7,1.1320754716981132,1.1320754716981132,0.95054022369379931,16.3,16.3,3.1,0.73619631901840488,0.73619631901840488,1.1345157508603412,16.3,16.3,3.1,0.73619631901840488,0.73619631901840488,1.1345157508603412,12.1,12.1,2.5,0.99173553719008267,0.99173553719008267,1.4067995310668231,12.1,12.1,2.5,0.99173553719008267,0.99173553719008267,1.4067995310668231]
[2004,12.1,12.3,0.99173553719008267,0.97560975609756095,12.1,12.3,0.99173553719008267,0.97560975609756095,12.1,13.9,0.99173553719008267,0.86330935251798557,11.9,13.7,1.0084033613445378,0.87591240875912413,12.5,13.9,0.96,0.86330935251798557,12.3,13.7,0.97560975609756095,0.87591240875912413,12.4,13.6,0.96774193548387089,0.88235294117647056,12.2,13.4,0.98360655737704927,0.89552238805970152,12.2,13.5,0.98360655737704927,0.88888888888888884,12,13.3,1,0.90225563909774431,12.1,12.3,0.99173553719008267,0.97560975609756095,12.1,12.3,0.99173553719008267,0.97560975609756095,12.1,12.3,0.99173553719008267,0.97560975609756095,11.9,12.1,1.0084033613445378,0.99173553719008267,12,12.2,1,0.98360655737704927,11.8,12,1.0169491525423728,1,11.9,12.1,1.0084033613445378,0.99173553719008267,11.7,11.9,1.0256410256410258,1.0084033613445378,11.7,11.9,1.0256410256410258,1.0084033613445378,11.5,11.7,1.0434782608695652,1.0256410256410258,null,12.2,12.2,4.3,0.98360655737704927,0.98360655737704927,0.8179067041086181,13,13,4.3,0.92307692307692313,0.92307692307692313,0.8179067041086181,13,13,4.3,0.92307692307692313,0.92307692307692313,0.8179067041086181,18,18,3.7,0.66666666666666663,0.66666666666666663,0.95054022369379931,18,18,3.7,0.66666666666666663,0.66666666666666663,0.95054022369379931,14.1,14.1,3.2,0.85106382978723405,0.85106382978723405,1.0990621336459554,14.1,14.1,3.2,0.85106382978723405,0.85106382978723405,1.0990621336459554,10.6,10.6,3.7,1.1320754716981132,1.1320754716981132,0.95054022369379931,10.6,10.6,3.7,1.1320754716981132,1.1320754716981132,0.95054022369379931,16.3,16.3,3.1,0.73619631901840488,0.73619631901840488,1.1345157508603412,16.3,16.3,3.1,0.73619631901840488,0.73619631901840488,1.1345157508603412,12.1,12.1,2.5,0.99173553719008267,0.99173553719008267,1.4067995310668231,12.1,12.1,2.5,0.99173553719008267,0.99173553719008267,1.4067995310668231]
[2005,12.1,12.3,0.99173553719008267,0.97560975609756095,12.1,12.3,0.99173553719008267,0.97560975609756095,12.1,13.9,0.99173553719008267,0.86330935251798557,11.9,13.7,1.0084033613445378,0.87591240875912413,12.5,13.9,0.96,0.86330935251798557,12.3,13.7,0.97560975609756095,0.87591240875912413,12.4,13.6,0.96774193548387089,0.88235294117647056,12.2,13.4,0.98360655737704927,0.89552238805970152,12.2,13.5,0.98360655737704927,0.88888888888888884,12,13.3,1,0.90225563909774431,12.1,12.3,0.99173553719008267,0.97560975609756095,12.1,12.3,0.99173553719008267,0.97560975609756095,12.1,12.3,0.99173553719008267,0.97560975609756095,11.9,12.1,1.0084033613445378,0.99173553719008267,12,12.2,1,0.98360655737704927,11.8,12,1.0169491525423728,1,11.9,12.1,1.0084033613445378,0.99173553719008267,11.7,11.9,1.0256410256410258,1.0084033613445378,11.7,11.9,1.0256410256410258,1.0084033613445378,11.5,11.7,1.0434782608695652,1.0256410256410258,null,12.2,12.2,4.3,0.98360655737704927,0.98360655737704927,0.8179067041086181,13,13,4.3,0.92307692307692313,0.92307692307692313,0.8179067041086181,13,13,4.3,0.92307692307692313,0.92307692307692313,0.8179067041086181,18,18,3.7,0.66666666666666663,0.66666666666666663,0.95054022369379931,18,18,3.7,0.66666666666666663,0.66666666666666663,0.95054022369379931,14.1,14.1,3.2,0.85106382978723405,0.85106382978723405,1.0990621336459554,14.1,14.1,3.2,0.85106382978723405,0.85106382978723405,1.0990621336459554,10.6,10.6,3.7,1.1320754716981132,1.1320754716981132,0.95054022369379931,10.6,10.6,3.7,1.1320754716981132,1.1320754716981132,0.95054022369379931,16.3,16.3,3.1,0.73619631901840488,0.73619631901840488,1.1345157508603412,16.3,16.3,3.1,0.73619631901840488,0.73619631901840488,1.1345157508603412,12.1,12.1,2.5,0.99173553719008267,0.99173553719008267,1.4067995310668231,12.1,12.1,2.5,0.99173553719008267,0.99173553719008267,1.4067995310668231]
[2006,12.1,12.3,0.99173553719008267,0.97560975609756095,12.1,12.3,0.99173553719008267,0.97560975609756095,12.1,13.9,0.99173553719008267,0.86330935251798557,11.9,13.7,1.0084033613445378,0.87591240875912413,12.5,13.9,0.96,0.86330935251798557,12.3,13.7,0.97560975609756095,0.87591240875912413,12.4,13.6,0.96774193548387089,0.88235294117647056,12.2,13.4,0.98360655737704927,0.89552238805970152,12.2,13.5,0.98360655737704927,0.88888888888888884,12,13.3,1,0.90225563909774431,12.1,12.3,0.99173553719008267,0.97560975609756095,12.1,12.3,0.99173553719008267,0.97560975609756095,12.1,12.3,0.99173553719008267,0.97560975609756095,11.9,12.1,1.0084033613445378,0.99173553719008267,12,12.2,1,0.98360655737704927,11.8,12,1.0169491525423728,1,11.9,12.1,1.0084033613445378,0.99173553719008267,11.7,11.9,1.0256410256410258,1.0084033613445378,11.7,11.9,1.0256410256410258,1.0084033613445378,11.5,11.7,1.0434782608695652,1.0256410256410258,null,12.2,12.2,4.3,0.98360655737704927,0.98360655737704927,0.8179067041086181,13,13,4.3,0.92307692307692313,0.92307692307692313,0.8179067041086181,13,13,4.3,0.92307692307692313,0.92307692307692313,0.8179067041086181,18,18,3.7,0.66666666666666663,0.66666666666666663,0.95054022369379931,18,18,3.7,0.66666666666666663,0.66666666666666663,0.95054022369379931,14.1,14.1,3.2,0.85106382978723405,0.85106382978723405,1.0990621336459554,14.1,14.1,3.2,0.85106382978723405,0.85106382978723405,1.0990621336459554,10.6,10.6,3.7,1.1320754716981132,1.1320754716981132,0.95054022369379931,10.6,10.6,3.7,1.1320754716981132,1.1320754716981132,0.95054022369379931,16.3,16.3,3.1,0.73619631901840488,0.73619631901840488,1.1345157508603412,16.3,16.3,3.1,0.73619631901840488,0.73619631901840488,1.1345157508603412,12.1,12.1,2.5,0.99173553719008267,0.99173553719008267,1.4067995310668231,12.1,12.1,2.5,0.99173553719008267,0.99173553719008267,1.4067995310668231]
[2007,12.1,12.3,0.99173553719008267,0.97560975609756095,12.1,12.3,0.99173553719008267,0.97560975609756095,12.1,13.9,0.99173553719008267,0.86330935251798557,11.9,13.7,1.0084033613445378,0.87591240875912413,12.5,13.9,0.96,0.86330935251798557,12.3,13.7,0.97560975609756095,0.87591240875912413,12.4,13.6,0.96774193548387089,0.88235294117647056,12.2,13.4,0.98360655737704927,0.89552238805970152,12.2,13.5,0.98360655737704927,0.88888888888888884,12,13.3,1,0.90225563909774431,12.1,12.3,0.99173553719008267,0.97560975609756095,12.1,12.3,0.99173553719008267,0.97560975609756095,12.1,12.3,0.99173553719008267,0.97560975609756095,11.9,12.1,1.0084033613445378,0.99173553719008267,12,12.2,1,0.98360655737704927,11.8,12,1.0169491525423728,1,11.9,12.1,1.0084033613445378,0.99173553719008267,11.7,11.9,1.0256410256410258,1.0084033613445378,11.7,11.9,1.0256410256410258,1.0084033613445378,11.5,11.7,1.0434782608695652,1.0256410256410258,null,12.2,12.2,4.3,0.98360655737704927,0.98360655737704927,0.8179067041086181,13,13,4.3,0.92307692307692313,0.92307692307692313,0.8179067041086181,13,13,4.3,0.92307692307692313,0.92307692307692313,0.8179067041086181,18,18,3.7,0.66666666666666663,0.66666666666666663,0.95054022369379931,18,18,3.7,0.66666666666666663,0.66666666666666663,0.95054022369379931,14.1,14.1,3.2,0.85106382978723405,0.85106382978723405,1.0990621336459554,14.1,14.1,3.2,0.85106382978723405,0.85106382978723405,1.0990621336459554,10.6,10.6,3.7,1.1320754716981132,1.1320754716981132,0.95054022369379931,10.6,10.6,3.7,1.1320754716981132,1.1320754716981132,0.95054022369379931,16.3,16.3,3.1,0.73619631901840488,0.73619631901840488,1.1345157508603412,16.3,16.3,3.1,0.73619631901840488,0.73619631901840488,1.1345157508603412,12.1,12.1,2.5,0.99173553719008267,0.99173553719008267,1.4067995310668231,12.1,12.1,2.5,0.99173553719008267,0.99173553719008267,1.4067995310668231]
[2008,12.1,12.3,0.99173553719008267,0.97560975609756095,12.1,12.3,0.99173553719008267,0.97560975609756095,12.1,13.9,0.99173553719008267,0.86330935251798557,11.9,13.7,1.0084033613445378,0.87591240875912413,12.5,13.9,0.96,0.86330935251798557,12.3,13.7,0.97560975609756095,0.87591240875912413,12.4,13.6,0.96774193548387089,0.88235294117647056,12.2,13.4,0.98360655737704927,0.89552238805970152,12.2,13.5,0.98360655737704927,0.88888888888888884,12,13.3,1,0.90225563909774431,12.1,12.3,0.99173553719008267,0.97560975609756095,12.1,12.3,0.99173553719008267,0.97560975609756095,12.1,12.3,0.99173553719008267,0.97560975609756095,11.9,12.1,1.0084033613445378,0.99173553719008267,12,12.2,1,0.98360655737704927,11.8,12,1.0169491525423728,1,11.9,12.1,1.0084033613445378,0.99173553719008267,11.7,11.9,1.0256410256410258,1.0084033613445378,11.7,11.9,1.0256410256410258,1.0084033613445378,11.5,11.7,1.0434782608695652,1.0256410256410258,null,12.2,12.2,4.3,0.98360655737704927,0.98360655737704927,0.8179067041086181,13,13,4.3,0.92307692307692313,0.92307692307692313,0.8179067041086181,13,13,4.3,0.92307692307692313,0.92307692307692313,0.8179067041086181,18,18,3.7,0.66666666666666663,0.66666666666666663,0.95054022369379931,18,18,3.7,0.66666666666666663,0.66666666666666663,0.95054022369379931,14.1,14.1,3.2,0.85106382978723405,0.85106382978723405,1.0990621336459554,14.1,14.1,3.2,0.85106382978723405,0.85106382978723405,1.0990621336459554,10.6,10.6,3.7,1.1320754716981132,1.1320754716981132,0.95054022369379931,10.6,10.6,3.7,1.1320754716981132,1.1320754716981132,0.95054022369379931,16.3,16.3,3.1,0.73619631901840488,0.73619631901840488,1.1345157508603412,16.3,16.3,3.1,0.73619631901840488,0.73619631901840488,1.1345157508603412,12.1,12.1,2.5,0.99173553719008267,0.99173553719008267,1.4067995310668231,12.1,12.1,2.5,0.99173553719008267,0.99173553719008267,1.4067995310668231]
[2009,12.1,12.3,0.99173553719008267,0.97560975609756095,12.1,12.3,0.99173553719008267,0.97560975609756095,12.1,13.9,0.99173553719008267,0.86330935251798557,11.9,13.7,1.0084033613445378,0.87591240875912413,12.5,13.9,0.96,0.86330935251798557,12.3,13.7,0.97560975609756095,0.87591240875912413,12.4,13.6,0.96774193548387089,0.88235294117647056,12.2,13.4,0.98360655737704927,0.89552238805970152,12.2,13.5,0.98360655737704927,0.88888888888888884,12,13.3,1,0.90225563909774431,12.1,12.3,0.99173553719008267,0.97560975609756095,12.1,12.3,0.99173553719008267,0.97560975609756095,12.1,12.3,0.99173553719008267,0.97560975609756095,11.9,12.1,1.0084033613445378,0.99173553719008267,12,12.2,1,0.98360655737704927,11.8,12,1.0169491525423728,1,11.9,12.1,1.0084033613445378,0.99173553719008267,11.7,11.9,1.0256410256410258,1.0084033613445378,11.7,11.9,1.0256410256410258,1.0084033613445378,11.5,11.7,1.0434782608695652,1.0256410256410258,null,12.2,12.2,4.3,0.98360655737704927,0.98360655737704927,0.8179067041086181,13,13,4.3,0.92307692307692313,0.92307692307692313,0.8179067041086181,13,13,4.3,0.92307692307692313,0.92307692307692313,0.8179067041086181,18,18,3.7,0.66666666666666663,0.66666666666666663,0.95054022369379931,18,18,3.7,0.66666666666666663,0.66666666666666663,0.95054022369379931,14.1,14.1,3.2,0.85106382978723405,0.85106382978723405,1.0990621336459554,14.1,14.1,3.2,0.85106382978723405,0.85106382978723405,1.0990621336459554,10.6,10.6,3.7,1.1320754716981132,1.1320754716981132,0.95054022369379931,10.6,10.6,3.7,1.1320754716981132,1.1320754716981132,0.95054022369379931,16.3,16.3,3.1,0.73619631901840488,0.73619631901840488,1.1345157508603412,16.3,16.3,3.1,0.73619631901840488,0.73619631901840488,1.1345157508603412,12.1,12.1,2.5,0.99173553719008267,0.99173553719008267,1.4067995310668231,12.1,12.1,2.5,0.99173553719008267,0.99173553719008267,1.4067995310668231]
[2010,12.1,12.3,0.99173553719008267,0.97560975609756095,12.1,12.3,0.99173553719008267,0.97560975609756095,12.1,13.9,0.99173553719008267,0.86330935251798557,11.9,13.7,1.0084033613445378,0.87591240875912413,12.5,13.9,0.96,0.86330935251798557,12.3,13.7,0.97560975609756095,0.87591240875912413,12.4,13.6,0.96774193548387089,0.88235294117647056,12.2,13.4,0.98360655737704927,0.89552238805970152,12.2,13.5,0.98360655737704927,0.88888888888888884,12,13.3,1,0.90225563909774431,12.1,12.3,0.99173553719008267,0.97560975609756095,12.1,12.3,0.99173553719008267,0.97560975609756095,12.1,12.3,0.99173553719008267,0.97560975609756095,11.9,12.1,1.0084033613445378,0.99173553719008267,12,12.2,1,0.98360655737704927,11.8,12,1.0169491525423728,1,11.9,12.1,1.0084033613445378,0.99173553719008267,11.7,11.9,1.0256410256410258,1.0084033613445378,11.7,11.9,1.0256410256410258,1.0084033613445378,11.5,11.7,1.0434782608695652,1.0256410256410258,null,12.2,12.2,4.3,0.98360655737704927,0.98360655737704927,0.8179067041086181,13,13,4.3,0.92307692307692313,0.92307692307692313,0.8179067041086181,13,13,4.3,0.92307692307692313,0.92307692307692313,0.8179067041086181,18,18,3.7,0.66666666666666663,0.66666666666666663,0.95054022369379931,18,18,3.7,0.66666666666666663,0.66666666666666663,0.95054022369379931,14.1,14.1,3.2,0.85106382978723405,0.85106382978723405,1.0990621336459554,14.1,14.1,3.2,0.85106382978723405,0.85106382978723405,1.0990621336459554,10.6,10.6,3.7,1.1320754716981132,1.1320754716981132,0.95054022369379931,10.6,10.6,3.7,1.1320754716981132,1.1320754716981132,0.95054022369379931,16.3,16.3,3.1,0.73619631901840488,0.73619631901840488,1.1345157508603412,16.3,16.3,3.1,0.73619631901840488,0.73619631901840488,1.1345157508603412,12.1,12.1,2.5,0.99173553719008267,0.99173553719008267,1.4067995310668231,12.1,12.1,2.5,0.99173553719008267,0.99173553719008267,1.4067995310668231]
[2011,12.1,12.3,0.99173553719008267,0.97560975609756095,12.1,12.3,0.99173553719008267,0.97560975609756095,12.1,13.9,0.99173553719008267,0.86330935251798557,11.9,13.7,1.0084033613445378,0.87591240875912413,12.5,13.9,0.96,0.86330935251798557,12.3,13.7,0.97560975609756095,0.87591240875912413,12.4,13.6,0.96774193548387089,0.88235294117647056,12.2,13.4,0.98360655737704927,0.89552238805970152,12.2,13.5,0.98360655737704927,0.88888888888888884,12,13.3,1,0.90225563909774431,12.1,12.3,0.99173553719008267,0.97560975609756095,12.1,12.3,0.99173553719008267,0.97560975609756095,12.1,12.3,0.99173553719008267,0.97560975609756095,11.9,12.1,1.0084033613445378,0.99173553719008267,12,12.2,1,0.98360655737704927,11.8,12,1.0169491525423728,1,11.9,12.1,1.0084033613445378,0.99173553719008267,11.7,11.9,1.0256410256410258,1.0084033613445378,11.7,11.9,1.0256410256410258,1.0084033613445378,11.5,11.7,1.0434782608695652,1.0256410256410258,null,12.2,12.2,4.3,0.98360655737704927,0.98360655737704927,0.8179067041086181,13,13,4.3,0.92307692307692313,0.92307692307692313,0.8179067041086181,13,13,4.3,0.92307692307692313,0.92307692307692313,0.8179067041086181,18,18,3.7,0.66666666666666663,0.66666666666666663,0.95054022369379931,18,18,3.7,0.66666666666666663,0.66666666666666663,0.95054022369379931,14.1,14.1,3.2,0.85106382978723405,0.85106382978723405,1.0990621336459554,14.1,14.1,3.2,0.85106382978723405,0.85106382978723405,1.0990621336459554,10.6,10.6,3.7,1.1320754716981132,1.1320754716981132,0.95054022369379931,10.6,10.6,3.7,1.1320754716981132,1.1320754716981132,0.95054022369379931,16.3,16.3,3.1,0.73619631901840488,0.73619631901840488,1.1345157508603412,16.3,16.3,3.1,0.73619631901840488,0.73619631901840488,1.1345157508603412,12.1,12.1,2.5,0.99173553719008267,0.99173553719008267,1.4067995310668231,12.1,12.1,2.5,0.99173553719008267,0.99173553719008267,1.4067995310668231]
[2012,12.1,12.3,0.99173553719008267,0.97560975609756095,12.1,12.3,0.99173553719008267,0.97560975609756095,12.1,13.9,0.99173553719008267,0.86330935251798557,11.9,13.7,1.0084033613445378,0.87591240875912413,12.5,13.9,0.96,0.86330935251798557,12.3,13.7,0.97560975609756095,0.87591240875912413,12.4,13.6,0.96774193548387089,0.88235294117647056,12.2,13.4,0.98360655737704927,0.89552238805970152,12.2,13.5,0.98360655737704927,0.88888888888888884,12,13.3,1,0.90225563909774431,12.1,12.3,0.99173553719008267,0.97560975609756095,12.1,12.3,0.99173553719008267,0.97560975609756095,12.1,12.3,0.99173553719008267,0.97560975609756095,11.9,12.1,1.0084033613445378,0.99173553719008267,12,12.2,1,0.98360655737704927,11.8,12,1.0169491525423728,1,11.9,12.1,1.0084033613445378,0.99173553719008267,11.7,11.9,1.0256410256410258,1.0084033613445378,11.7,11.9,1.0256410256410258,1.0084033613445378,11.5,11.7,1.0434782608695652,1.0256410256410258,null,12.2,12.2,4.3,0.98360655737704927,0.98360655737704927,0.8179067041086181,13,13,4.3,0.92307692307692313,0.92307692307692313,0.8179067041086181,13,13,4.3,0.92307692307692313,0.92307692307692313,0.8179067041086181,18,18,3.7,0.66666666666666663,0.66666666666666663,0.95054022369379931,18,18,3.7,0.66666666666666663,0.66666666666666663,0.95054022369379931,14.1,14.1,3.2,0.85106382978723405,0.85106382978723405,1.0990621336459554,14.1,14.1,3.2,0.85106382978723405,0.85106382978723405,1.0990621336459554,10.6,10.6,3.7,1.1320754716981132,1.1320754716981132,0.95054022369379931,10.6,10.6,3.7,1.1320754716981132,1.1320754716981132,0.95054022369379931,16.3,16.3,3.1,0.73619631901840488,0.73619631901840488,1.1345157508603412,16.3,16.3,3.1,0.73619631901840488,0.73619631901840488,1.1345157508603412,12.1,12.1,2.5,0.99173553719008267,0.99173553719008267,1.4067995310668231,12.1,12.1,2.5,0.99173553719008267,0.99173553719008267,1.4067995310668231]
[2013,12.1,12.3,0.99173553719008267,0.97560975609756095,12.1,12.3,0.99173553719008267,0.97560975609756095,12.1,13.9,0.99173553719008267,0.86330935251798557,11.9,13.7,1.0084033613445378,0.87591240875912413,12.5,13.9,0.96,0.86330935251798557,12.3,13.7,0.97560975609756095,0.87591240875912413,12.4,13.6,0.96774193548387089,0.88235294117647056,12.2,13.4,0.98360655737704927,0.89552238805970152,12.2,13.5,0.98360655737704927,0.88888888888888884,12,13.3,1,0.90225563909774431,12.1,12.3,0.99173553719008267,0.97560975609756095,12.1,12.3,0.99173553719008267,0.97560975609756095,12.1,12.3,0.99173553719008267,0.97560975609756095,11.9,12.1,1.0084033613445378,0.99173553719008267,12,12.2,1,0.98360655737704927,11.8,12,1.0169491525423728,1,11.9,12.1,1.0084033613445378,0.99173553719008267,11.7,11.9,1.0256410256410258,1.0084033613445378,11.7,11.9,1.0256410256410258,1.0084033613445378,11.5,11.7,1.0434782608695652,1.0256410256410258,null,12.2,12.2,4.3,0.98360655737704927,0.98360655737704927,0.8179067041086181,13,13,4.3,0.92307692307692313,0.92307692307692313,0.8179067041086181,13,13,4.3,0.92307692307692313,0.92307692307692313,0.8179067041086181,18,18,3.7,0.66666666666666663,0.66666666666666663,0.95054022369379931,18,18,3.7,0.66666666666666663,0.66666666666666663,0.95054022369379931,14.1,14.1,3.2,0.85106382978723405,0.85106382978723405,1.0990621336459554,14.1,14.1,3.2,0.85106382978723405,0.85106382978723405,1.0990621336459554,10.6,10.6,3.7,1.1320754716981132,1.1320754716981132,0.95054022369379931,10.6,10.6,3.7,1.1320754716981132,1.1320754716981132,0.95054022369379931,16.3,16.3,3.1,0.73619631901840488,0.73619631901840488,1.1345157508603412,16.3,16.3,3.1,0.73619631901840488,0.73619631901840488,1.1345157508603412,12.1,12.1,2.5,0.99173553719008267,0.99173553719008267,1.4067995310668231,12.1,12.1,2.5,0.99173553719008267,0.99173553719008267,1.4067995310668231]
[2014,12.1,12.3,0.99173553719008267,0.97560975609756095,12.1,12.3,0.99173553719008267,0.97560975609756095,12.1,13.9,0.99173553719008267,0.86330935251798557,11.9,13.7,1.0084033613445378,0.87591240875912413,12.5,13.9,0.96,0.86330935251798557,12.3,13.7,0.97560975609756095,0.87591240875912413,12.4,13.6,0.96774193548387089,0.88235294117647056,12.2,13.4,0.98360655737704927,0.89552238805970152,12.2,13.5,0.98360655737704927,0.88888888888888884,12,13.3,1,0.90225563909774431,12.1,12.3,0.99173553719008267,0.97560975609756095,12.1,12.3,0.99173553719008267,0.97560975609756095,12.1,12.3,0.99173553719008267,0.97560975609756095,11.9,12.1,1.0084033613445378,0.99173553719008267,12,12.2,1,0.98360655737704927,11.8,12,1.0169491525423728,1,11.9,12.1,1.0084033613445378,0.99173553719008267,11.7,11.9,1.0256410256410258,1.0084033613445378,11.7,11.9,1.0256410256410258,1.0084033613445378,11.5,11.7,1.0434782608695652,1.0256410256410258,null,12.2,12.2,4.3,0.98360655737704927,0.98360655737704927,0.8179067041086181,13,13,4.3,0.92307692307692313,0.92307692307692313,0.8179067041086181,13,13,4.3,0.92307692307692313,0.92307692307692313,0.8179067041086181,18,18,3.7,0.66666666666666663,0.66666666666666663,0.95054022369379931,18,18,3.7,0.66666666666666663,0.66666666666666663,0.95054022369379931,14.1,14.1,3.2,0.85106382978723405,0.85106382978723405,1.0990621336459554,14.1,14.1,3.2,0.85106382978723405,0.85106382978723405,1.0990621336459554,10.6,10.6,3.7,1.1320754716981132,1.1320754716981132,0.95054022369379931,10.6,10.6,3.7,1.1320754716981132,1.1320754716981132,0.95054022369379931,16.3,16.3,3.1,0.73619631901840488,0.73619631901840488,1.1345157508603412,16.3,16.3,3.1,0.73619631901840488,0.73619631901840488,1.1345157508603412,12.1,12.1,2.5,0.99173553719008267,0.99173553719008267,1.4067995310668231,12.1,12.1,2.5,0.99173553719008267,0.99173553719008267,1.4067995310668231]
[2015,12.1,12.3,0.99173553719008267,0.97560975609756095,12.1,12.3,0.99173553719008267,0.97560975609756095,12.1,13.9,0.99173553719008267,0.86330935251798557,11.9,13.7,1.0084033613445378,0.87591240875912413,12.5,13.9,0.96,0.86330935251798557,12.3,13.7,0.97560975609756095,0.87591240875912413,12.4,13.6,0.96774193548387089,0.88235294117647056,12.2,13.4,0.98360655737704927,0.89552238805970152,12.2,13.5,0.98360655737704927,0.88888888888888884,12,13.3,1,0.90225563909774431,12.1,12.3,0.99173553719008267,0.97560975609756095,12.1,12.3,0.99173553719008267,0.97560975609756095,12.1,12.3,0.99173553719008267,0.97560975609756095,11.9,12.1,1.0084033613445378,0.99173553719008267,12,12.2,1,0.98360655737704927,11.8,12,1.0169491525423728,1,11.9,12.1,1.0084033613445378,0.99173553719008267,11.7,11.9,1.0256410256410258,1.0084033613445378,11.7,11.9,1.0256410256410258,1.0084033613445378,11.5,11.7,1.0434782608695652,1.0256410256410258,null,12.2,12.2,4.3,0.98360655737704927,0.98360655737704927,0.8179067041086181,13,13,4.3,0.92307692307692313,0.92307692307692313,0.8179067041086181,13,13,4.3,0.92307692307692313,0.92307692307692313,0.8179067041086181,18,18,3.7,0.66666666666666663,0.66666666666666663,0.95054022369379931,18,18,3.7,0.66666666666666663,0.66666666666666663,0.95054022369379931,14.1,14.1,3.2,0.85106382978723405,0.85106382978723405,1.0990621336459554,14.1,14.1,3.2,0.85106382978723405,0.85106382978723405,1.0990621336459554,10.6,10.6,3.7,1.1320754716981132,1.1320754716981132,0.95054022369379931,10.6,10.6,3.7,1.1320754716981132,1.1320754716981132,0.95054022369379931,16.3,16.3,3.1,0.73619631901840488,0.73619631901840488,1.1345157508603412,16.3,16.3,3.1,0.73619631901840488,0.73619631901840488,1.1345157508603412,12.1,12.1,2.5,0.99173553719008267,0.99173553719008267,1.4067995310668231,12.1,12.1,2.5,0.99173553719008267,0.99173553719008267,1.4067995310668231]
[2016,12.1,12.3,0.99173553719008267,0.97560975609756095,12.1,12.3,0.99173553719008267,0.97560975609756095,12.1,13.9,0.99173553719008267,0.86330935251798557,11.9,13.7,1.0084033613445378,0.87591240875912413,12.5,13.9,0.96,0.86330935251798557,12.3,13.7,0.97560975609756095,0.87591240875912413,12.4,13.6,0.96774193548387089,0.88235294117647056,12.2,13.4,0.98360655737704927,0.89552238805970152,12.2,13.5,0.98360655737704927,0.88888888888888884,12,13.3,1,0.90225563909774431,12.1,12.3,0.99173553719008267,0.97560975609756095,12.1,12.3,0.99173553719008267,0.97560975609756095,12.1,12.3,0.99173553719008267,0.97560975609756095,11.9,12.1,1.0084033613445378,0.99173553719008267,12,12.2,1,0.98360655737704927,11.8,12,1.0169491525423728,1,11.9,12.1,1.0084033613445378,0.99173553719008267,11.7,11.9,1.0256410256410258,1.0084033613445378,11.7,11.9,1.0256410256410258,1.0084033613445378,11.5,11.7,1.0434782608695652,1.0256410256410258,null,12.2,12.2,4.3,0.98360655737704927,0.98360655737704927,0.8179067041086181,13,13,4.3,0.92307692307692313,0.92307692307692313,0.8179067041086181,13,13,4.3,0.92307692307692313,0.92307692307692313,0.8179067041086181,18,18,3.7,0.66666666666666663,0.66666666666666663,0.95054022369379931,18,18,3.7,0.66666666666666663,0.66666666666666663,0.95054022369379931,14.1,14.1,3.2,0.85106382978723405,0.85106382978723405,1.0990621336459554,14.1,14.1,3.2,0.85106382978723405,0.85106382978723405,1.0990621336459554,10.6,10.6,3.7,1.1320754716981132,1.1320754716981132,0.95054022369379931,10.6,10.6,3.7,1.1320754716981132,1.1320754716981132,0.95054022369379931,16.3,16.3,3.1,0.73619631901840488,0.73619631901840488,1.1345157508603412,16.3,16.3,3.1,0.73619631901840488,0.73619631901840488,1.1345157508603412,12.1,12.1,2.5,0.99173553719008267,0.99173553719008267,1.4067995310668231,12.1,12.1,2.5,0.99173553719008267,0.99173553719008267,1.4067995310668231]
[2017,12.1,12.3,0.99173553719008267,0.97560975609756095,12.1,12.3,0.99173553719008267,0.97560975609756095,12.1,13.9,0.99173553719008267,0.86330935251798557,11.9,13.7,1.0084033613445378,0.87591240875912413,12.5,13.9,0.96,0.86330935251798557,12.3,13.7,0.97560975609756095,0.87591240875912413,12.4,13.6,0.96774193548387089,0.88235294117647056,12.2,13.4,0.98360655737704927,0.89552238805970152,12.2,13.5,0.98360655737704927,0.88888888888888884,12,13.3,1,0.90225563909774431,12.1,12.3,0.99173553719008267,0.97560975609756095,12.1,12.3,0.99173553719008267,0.97560975609756095,12.1,12.3,0.99173553719008267,0.97560975609756095,11.9,12.1,1.0084033613445378,0.99173553719008267,12,12.2,1,0.98360655737704927,11.8,12,1.0169491525423728,1,11.9,12.1,1.0084033613445378,0.99173553719008267,11.7,11.9,1.0256410256410258,1.0084033613445378,11.7,11.9,1.0256410256410258,1.0084033613445378,11.5,11.7,1.0434782608695652,1.0256410256410258,null,12.2,12.2,4.3,0.98360655737704927,0.98360655737704927,0.8179067041086181,13,13,4.3,0.92307692307692313,0.92307692307692313,0.8179067041086181,13,13,4.3,0.92307692307692313,0.92307692307692313,0.8179067041086181,18,18,3.7,0.66666666666666663,0.66666666666666663,0.95054022369379931,18,18,3.7,0.66666666666666663,0.66666666666666663,0.95054022369379931,14.1,14.1,3.2,0.85106382978723405,0.85106382978723405,1.0990621336459554,14.1,14.1,3.2,0.85106382978723405,0.85106382978723405,1.0990621336459554,10.6,10.6,3.7,1.1320754716981132,1.1320754716981132,0.95054022369379931,10.6,10.6,3.7,1.1320754716981132,1.1320754716981132,0.95054022369379931,16.3,16.3,3.1,0.73619631901840488,0.73619631901840488,1.1345157508603412,16.3,16.3,3.1,0.73619631901840488,0.73619631901840488,1.1345157508603412,12.1,12.1,2.5,0.99173553719008267,0.99173553719008267,1.4067995310668231,12.1,12.1,2.5,0.99173553719008267,0.99173553719008267,1.4067995310668231]
[2018,12.1,12.3,0.99173553719008267,0.97560975609756095,12.1,12.3,0.99173553719008267,0.97560975609756095,12.1,13.9,0.99173553719008267,0.86330935251798557,11.9,13.7,1.0084033613445378,0.87591240875912413,12.5,13.9,0.96,0.86330935251798557,12.3,13.7,0.97560975609756095,0.87591240875912413,12.4,13.6,0.96774193548387089,0.88235294117647056,12.2,13.4,0.98360655737704927,0.89552238805970152,12.2,13.5,0.98360655737704927,0.88888888888888884,12,13.3,1,0.90225563909774431,12.1,12.3,0.99173553719008267,0.97560975609756095,12.1,12.3,0.99173553719008267,0.97560975609756095,12.1,12.3,0.99173553719008267,0.97560975609756095,11.9,12.1,1.0084033613445378,0.99173553719008267,12,12.2,1,0.98360655737704927,11.8,12,1.0169491525423728,1,11.9,12.1,1.0084033613445378,0.99173553719008267,11.7,11.9,1.0256410256410258,1.0084033613445378,11.7,11.9,1.0256410256410258,1.0084033613445378,11.5,11.7,1.0434782608695652,1.0256410256410258,null,12.2,12.2,4.3,0.98360655737704927,0.98360655737704927,{"$f":"12/3.412/CG35","v":0.8179067041086181},13,13,4.3,0.92307692307692313,0.92307692307692313,0.8179067041086181,13,13,4.3,0.92307692307692313,0.92307692307692313,0.8179067041086181,18,18,3.7,0.66666666666666663,0.66666666666666663,0.95054022369379931,18,18,3.7,0.66666666666666663,0.66666666666666663,0.95054022369379931,14.1,14.1,3.2,0.85106382978723405,0.85106382978723405,1.0990621336459554,14.1,14.1,3.2,0.85106382978723405,0.85106382978723405,1.0990621336459554,10.6,10.6,3.7,1.1320754716981132,1.1320754716981132,0.95054022369379931,10.6,10.6,3.7,1.1320754716981132,1.1320754716981132,0.95054022369379931,16.3,16.3,3.1,0.73619631901840488,0.73619631901840488,1.1345157508603412,16.3,16.3,3.1,0.73619631901840488,0.73619631901840488,1.1345157508603412,12.1,12.1,2.5,0.99173553719008267,0.99173553719008267,1.4067995310668231,12.1,12.1,2.5,0.99173553719008267,0.99173553719008267,1.4067995310668231]
["ARTRM8",12.1,12.3,{"$f":"12/B36","v":0.99173553719008267},0.97560975609756095,12.1,12.3,{"$f":"12/F36","v":0.99173553719008267},0.97560975609756095,12.1,13.9,{"$f":"12/J36","v":0.99173553719008267},0.86330935251798557,12.5,13.9,{"$f":"12/N36","v":0.96},0.86330935251798557,12.5,13.9,{"$f":"12/R36","v":0.96},0.86330935251798557,12.3,13.7,{"$f":"12/V36","v":0.97560975609756095},0.87591240875912413,12.4,13.6,{"$f":"12/Z36","v":0.96774193548387089},0.88235294117647056,12.2,13.4,{"$f":"12/AD36","v":0.98360655737704927},0.89552238805970152,12.4,13.6,{"$f":"12/AH36","v":0.96774193548387089},0.88235294117647056,12.2,13.4,{"$f":"12/AL36","v":0.98360655737704927},0.89552238805970152,12.1,12.3,{"$f":"12/AP36","v":0.99173553719008267},0.97560975609756095,12.1,12.3,{"$f":"12/AT36","v":0.99173553719008267},0.97560975609756095,12.1,13.9,{"$f":"12/AX36","v":0.99173553719008267},0.86330935251798557,12.5,13.9,{"$f":"12/BB36","v":0.96},0.86330935251798557,12.5,13.9,{"$f":"12/BF36","v":0.96},0.86330935251798557,12.3,13.7,{"$f":"12/BJ36","v":0.97560975609756095},0.87591240875912413,12.4,13.6,{"$f":"12/BN36","v":0.96774193548387089},0.88235294117647056,12.2,13.4,{"$f":"12/BR36","v":0.98360655737704927},0.89552238805970152,12.4,13.6,{"$f":"12/BV36","v":0.96774193548387089},0.88235294117647056,12.2,13.4,{"$f":"12/BZ36","v":0.98360655737704927},0.89552238805970152,"ARTRM8 Table 275",11.8,14,{"$f":"8.2/3.412","v":2.4032825322391558},{"$f":"12/CE36","v":1.0169491525423728},0.8571428571428571,1.4634146341463417,{"$f":"CE36","v":11.8},{"$f":"CF36","v":14},2.4032825322391558,{"$f":"12/CK36","v":1.0169491525423728},0.8571428571428571,{"$f":"12/3.412/CM36","v":1.4634146341463417},11,12,3.3,{"$f":"12/CQ36","v":1.0909090909090908},1,{"$f":"12/3.412/CS36","v":1.0657572205051691},{"$f":"$CE36","v":11.8},{"$f":"$CF36","v":14},{"$f":"$CG36","v":2.4032825322391558},{"$f":"12/CW36","v":1.0169491525423728},0.8571428571428571,{"$f":"12/3.412/CY36","v":1.4634146341463417},{"$f":"$CQ36","v":11},{"$f":"$CR36","v":12},{"$f":"$CS36","v":3.3},{"$f":"12/DC36","v":1.0909090909090908},1,{"$f":"12/3.412/DE36","v":1.0657572205051691},{"$f":"$CE36","v":11.8},{"$f":"$CF36","v":14},{"$f":"$CG36","v":2.4032825322391558},{"$f":"12/DI36","v":1.0169491525423728},0.8571428571428571,{"$f":"12/3.412/DK36","v":1.4634146341463417},{"$f":"$CQ36","v":11},{"$f":"$CR36","v":12},{"$f":"$CS36","v":3.3},{"$f":"12/DO36","v":1.0909090909090908},1,{"$f":"12/3.412/DQ36","v":1.0657572205051691},{"$f":"$CE36","v":11.8},{"$f":"$CF36","v":14},{"$f":"$CG36","v":2.4032825322391558},{"$f":"12/DU36","v":1.0169491525423728},0.8571428571428571,{"$f":"12/3.412/DW36","v":1.4634146341463417},{"$f":"$CQ36","v":11},{"$f":"$CR36","v":12},{"$f":"$CS36","v":3.3},{"$f":"12/EA36","v":1.0909090909090908},1,{"$f":"12/3.412/EC36","v":1.0657572205051691},{"$f":"$CE36","v":11.8},{"$f":"$CF36","v":14},{"$f":"$CG36","v":2.4032825322391558},{"$f":"12/EG36","v":1.0169491525423728},0.8571428571428571,{"$f":"12/3.412/EI36","v":1.4634146341463417},{"$f":"$CQ36","v":11},{"$f":"$CR36","v":12},{"$f":"$CS36","v":3.3},{"$f":"12/EM36","v":1.0909090909090908},1,{"$f":"12/3.412/EO36","v":1.0657572205051691},{"$f":"$CE36","v":11.8},{"$f":"$CF36","v":14},{"$f":"$CG36","v":2.4032825322391558},{"$f":"12/ES36","v":1.0169491525423728},0.8571428571428571,{"$f":"12/3.412/EU36","v":1.4634146341463417},{"$f":"$CQ36","v":11},{"$f":"$CR36","v":12},{"$f":"$CS36","v":3.3},{"$f":"12/EY36","v":1.0909090909090908},1,{"$f":"12/3.412/FA36","v":1.0657572205051691},"ARTRM8 Table 275 (Air Cooled Heat Pumps)"]
["CPS",12.1,12.3,{"$f":"12/B37","v":0.99173553719008267},0.97560975609756095,12.1,12.3,0.99173553719008267,0.97560975609756095,12.1,13.9,0.99173553719008267,0.86330935251798557,11.9,13.7,1.0084033613445378,0.87591240875912413,12.5,13.9,0.96,0.86330935251798557,12.3,13.7,0.97560975609756095,0.87591240875912413,12.4,13.6,0.96774193548387089,0.88235294117647056,12.2,13.4,0.98360655737704927,0.89552238805970152,12.2,13.5,0.98360655737704927,0.88888888888888884,12,13.3,1,0.90225563909774431,12.1,12.3,0.99173553719008267,0.97560975609756095,12.1,12.3,0.99173553719008267,0.97560975609756095,12.1,12.3,0.99173553719008267,0.97560975609756095,11.9,12.1,1.0084033613445378,0.99173553719008267,12,12.2,1,0.98360655737704927,11.8,12,1.0169491525423728,1,11.9,12.1,1.0084033613445378,0.99173553719008267,11.7,11.9,1.0256410256410258,1.0084033613445378,11.7,11.9,1.0256410256410258,1.0084033613445378,11.5,11.7,1.0434782608695652,1.0256410256410258,"IECC2015 Table C403.2.3(1)",12.2,{"$f":"CE37","v":12.2},4.3,{"$f":"12/CE37","v":0.98360655737704927},0.98360655737704927,{"$f":"12/3.412/CG37","v":0.8179067041086181},13,{"$f":"CK37","v":13},4.3,{"$f":"12/CK37","v":0.92307692307692313},0.92307692307692313,{"$f":"12/3.412/CM37","v":0.8179067041086181},13,{"$f":"CQ37","v":13},4.3,{"$f":"12/CQ37","v":0.92307692307692313},0.92307692307692313,{"$f":"12/3.412/CS37","v":0.8179067041086181},18,{"$f":"CW37","v":18},3.7,{"$f":"12/CW37","v":0.66666666666666663},0.66666666666666663,{"$f":"12/3.412/CY37","v":0.95054022369379931},18,{"$f":"DC37","v":18},3.7,{"$f":"12/DC37","v":0.66666666666666663},0.66666666666666663,{"$f":"12/3.412/DE37","v":0.95054022369379931},14.1,{"$f":"DI37","v":14.1},3.2,{"$f":"12/DI37","v":0.85106382978723405},0.85106382978723405,{"$f":"12/3.412/DK37","v":1.0990621336459554},14.1,{"$f":"DO37","v":14.1},3.2,{"$f":"12/DO37","v":0.85106382978723405},0.85106382978723405,{"$f":"12/3.412/DQ37","v":1.0990621336459554},10.6,{"$f":"DU37","v":10.6},3.7,{"$f":"12/DU37","v":1.1320754716981132},1.1320754716981132,{"$f":"12/3.412/DW37","v":0.95054022369379931},10.6,{"$f":"EA37","v":10.6},3.7,{"$f":"12/EA37","v":1.1320754716981132},1.1320754716981132,{"$f":"12/3.412/EC37","v":0.95054022369379931},16.3,{"$f":"EG37","v":16.3},3.1,{"$f":"12/EG37","v":0.73619631901840488},0.73619631901840488,{"$f":"12/3.412/EI37","v":1.1345157508603412},16.3,{"$f":"EM37","v":16.3},3.1,{"$f":"12/EM37","v":0.73619631901840488},0.73619631901840488,{"$f":"12/3.412/EO37","v":1.1345157508603412},12.1,{"$f":"ES37","v":12.1},2.5,{"$f":"12/ES37","v":0.99173553719008267},0.99173553719008267,{"$f":"12/3.412/EU37","v":1.4067995310668231},12.1,{"$f":"EY37","v":12.1},2.5,{"$f":"12/EY37","v":0.99173553719008267},0.99173553719008267,{"$f":"12/3.412/FA37","v":1.4067995310668231},"IECC2015 Table C403.2.3(2)"]

{"sheet":"CRAC","index":14,"n_rows":41,"n_cols":73,"rows_kept":41,"cut":false,"hidden":true,"merged":[]}
[null,"ComputerRoomAC",null,null,"ComputerRoomAC",null,null,"ComputerRoomAC",null,null,"ComputerRoomAC",null,null,"ComputerRoomAC",null,null,"ComputerRoomAC",null,null,"ComputerRoomAC",null,null,"ComputerRoomAC",null,null,"ComputerRoomAC",null,null,"ComputerRoomAC",null,null,"ComputerRoomAC",null,null,"ComputerRoomAC",null,null,"ComputerRoomAC",null,null,"ComputerRoomAC",null,null,"ComputerRoomAC",null,null,"ComputerRoomAC",null,null,"ComputerRoomAC",null,null,"ComputerRoomAC",null,null,"ComputerRoomAC",null,null,"ComputerRoomAC",null,null,"ComputerRoomAC",null,null,"ComputerRoomAC",null,null,"ComputerRoomAC",null,null,"ComputerRoomAC"]
[null,"AirCooledDownflow",null,null,"AirCooledDownflow",null,null,"AirCooledDownflow",null,null,"WaterCooledDownflow",null,null,"WaterCooledDownflow",null,null,"WaterCooledDownflow",null,null,"WaterCooledwithFluidEconomizerDownflow",null,null,"WaterCooledwithFluidEconomizerDownflow",null,null,"WaterCooledwithFluidEconomizerDownflow",null,null,"GlycolCooledDownflow",null,null,"GlycolCooledDownflow",null,null,"GlycolCooledDownflow",null,null,"AirCooledUpflow",null,null,"AirCooledUpflow",null,null,"AirCooledUpflow",null,null,"WaterCooledUpflow",null,null,"WaterCooledUpflow",null,null,"WaterCooledUpflow",null,null,"WaterCooledwithFluidEconomizerUpflow",null,null,"WaterCooledwithFluidEconomizerUpflow",null,null,"WaterCooledwithFluidEconomizerUpflow",null,null,"GlycolCooledUpflow",null,null,"GlycolCooledUpflow",null,null,"GlycolCooledUpflow"]
[null,"Lessthan65kbtuh",null,null,"65to240kbtuh",null,null,"GreaterThan240kbtuh",null,null,"Lessthan65kbtuh",null,null,"65to240kbtuh",null,null,"GreaterThan240kbtuh",null,null,"Lessthan65kbtuh",null,null,"65to240kbtuh",null,null,"GreaterThan240kbtuh",null,null,"Lessthan65kbtuh",null,null,"65to240kbtuh",null,null,"GreaterThan240kbtuh",null,null,"Lessthan65kbtuh",null,null,"65to240kbtuh",null,null,"GreaterThan240kbtuh",null,null,"Lessthan65kbtuh",null,null,"65to240kbtuh",null,null,"GreaterThan240kbtuh",null,null,"Lessthan65kbtuh",null,null,"65to240kbtuh",null,null,"GreaterThan240kbtuh",null,null,"Lessthan65kbtuh",null,null,"65to240kbtuh",null,null,"GreaterThan240kbtuh"]
[null,{"$f":"B1&B2&B3","v":"ComputerRoomACAirCooledDownflowLessthan65kbtuh"},null,null,{"$f":"E1&E2&E3","v":"ComputerRoomACAirCooledDownflow65to240kbtuh"},null,null,{"$f":"H1&H2&H3","v":"ComputerRoomACAirCooledDownflowGreaterThan240kbtuh"},null,null,{"$f":"K1&K2&K3","v":"ComputerRoomACWaterCooledDownflowLessthan65kbtuh"},null,null,{"$f":"N1&N2&N3","v":"ComputerRoomACWaterCooledDownflow65to240kbtuh"},null,null,{"$f":"Q1&Q2&Q3","v":"ComputerRoomACWaterCooledDownflowGreaterThan240kbtuh"},null,null,{"$f":"T1&T2&T3","v":"ComputerRoomACWaterCooledwithFluidEconomizerDownflowLessthan65kbtuh"},null,null,{"$f":"W1&W2&W3","v":"ComputerRoomACWaterCooledwithFluidEconomizerDownflow65to240kbtuh"},null,null,{"$f":"Z1&Z2&Z3","v":"ComputerRoomACWaterCooledwithFluidEconomizerDownflowGreaterThan240kbtuh"},null,null,{"$f":"AC1&AC2&AC3","v":"ComputerRoomACGlycolCooledDownflowLessthan65kbtuh"},null,null,{"$f":"AF1&AF2&AF3","v":"ComputerRoomACGlycolCooledDownflow65to240kbtuh"},null,null,{"$f":"AI1&AI2&AI3","v":"ComputerRoomACGlycolCooledDownflowGreaterThan240kbtuh"},null,null,{"$f":"AL1&AL2&AL3","v":"ComputerRoomACAirCooledUpflowLessthan65kbtuh"},null,null,{"$f":"AO1&AO2&AO3","v":"ComputerRoomACAirCooledUpflow65to240kbtuh"},null,null,{"$f":"AR1&AR2&AR3","v":"ComputerRoomACAirCooledUpflowGreaterThan240kbtuh"},null,null,{"$f":"AU1&AU2&AU3","v":"ComputerRoomACWaterCooledUpflowLessthan65kbtuh"},null,null,{"$f":"AX1&AX2&AX3","v":"ComputerRoomACWaterCooledUpflow65to240kbtuh"},null,null,{"$f":"BA1&BA2&BA3","v":"ComputerRoomACWaterCooledUpflowGreaterThan240kbtuh"},null,null,{"$f":"BD1&BD2&BD3","v":"ComputerRoomACWaterCooledwithFluidEconomizerUpflowLessthan65kbtuh"},null,null,{"$f":"BG1&BG2&BG3","v":"ComputerRoomACWaterCooledwithFluidEconomizerUpflow65to240kbtuh"},null,null,{"$f":"BJ1&BJ2&BJ3","v":"ComputerRoomACWaterCooledwithFluidEconomizerUpflowGreaterThan240kbtuh"},null,null,{"$f":"BM1&BM2&BM3","v":"ComputerRoomACGlycolCooledUpflowLessthan65kbtuh"},null,null,{"$f":"BP1&BP2&BP3","v":"ComputerRoomACGlycolCooledUpflow65to240kbtuh"},null,null,{"$f":"BS1&BS2&BS3","v":"ComputerRoomACGlycolCooledUpflowGreaterThan240kbtuh"}]
["Manuf. Year","SCOP","Full Load","Part Load","SCOP","Full Load","Part Load","SCOP","Full Load","Part Load","SCOP","Full Load","Part Load","SCOP","Full Load","Part Load","SCOP","Full Load","Part Load","SCOP","Full Load","Part Load","SCOP","Full Load","Part Load","SCOP","Full Load","Part Load","SCOP","Full Load","Part Load","SCOP","Full Load","Part Load","SCOP","Full Load","Part Load","SCOP","Full Load","Part Load","SCOP","Full Load","Part Load","SCOP","Full Load","Part Load","SCOP","Full Load","Part Load","SCOP","Full Load","Part Load","SCOP","Full Load","Part Load","SCOP","Full Load","Part Load","SCOP","Full Load","Part Load","SCOP","Full Load","Part Load","SCOP","Full Load","Part Load","SCOP","Full Load","Part Load","SCOP","Full Load","Part Load"]
[1990,{"$f":"B$36","v":2.2000000000000002},{"$f":"3.517/B6","v":1.5986363636363634},{"$f":"C6","v":1.5986363636363634},2.1,{"$f":"3.517/E6","v":1.6747619047619047},{"$f":"F6","v":1.6747619047619047},1.9,{"$f":"3.517/H6","v":1.8510526315789475},{"$f":"I6","v":1.8510526315789475},2.6,{"$f":"3.517/K6","v":1.3526923076923076},{"$f":"L6","v":1.3526923076923076},2.5,{"$f":"3.517/N6","v":1.4068000000000001},{"$f":"O6","v":1.4068000000000001},2.4,{"$f":"3.517/Q6","v":1.4654166666666666},{"$f":"R6","v":1.4654166666666666},2.5499999999999998,{"$f":"3.517/T6","v":1.37921568627451},{"$f":"U6","v":1.37921568627451},2.4500000000000002,{"$f":"3.517/W6","v":1.4355102040816325},{"$f":"X6","v":1.4355102040816325},{"$f":"Z$36","v":2.35},{"$f":"3.517/Z6","v":1.4965957446808509},{"$f":"AA6","v":1.4965957446808509},2.5,{"$f":"3.517/AC6","v":1.4068000000000001},{"$f":"AD6","v":1.4068000000000001},2.15,{"$f":"3.517/AF6","v":1.6358139534883722},{"$f":"AG6","v":1.6358139534883722},2.1,{"$f":"3.517/AI6","v":1.6747619047619047},{"$f":"AJ6","v":1.6747619047619047},2.09,{"$f":"3.517/AL6","v":1.6827751196172249},{"$f":"AM6","v":1.6827751196172249},1.99,{"$f":"3.517/AO6","v":1.7673366834170854},{"$f":"AP6","v":1.7673366834170854},1.79,{"$f":"3.517/AR6","v":1.964804469273743},{"$f":"AS6","v":1.964804469273743},2.4900000000000002,{"$f":"3.517/AU6","v":1.412449799196787},{"$f":"AV6","v":1.412449799196787},2.39,{"$f":"3.517/AX6","v":1.4715481171548117},{"$f":"AY6","v":1.4715481171548117},2.29,{"$f":"3.517/BA6","v":1.5358078602620087},{"$f":"BB6","v":1.5358078602620087},2.44,{"$f":"3.517/BD6","v":1.4413934426229509},{"$f":"BE6","v":1.4413934426229509},2.34,{"$f":"3.517/BG6","v":1.502991452991453},{"$f":"BH6","v":1.502991452991453},2.2400000000000002,{"$f":"3.517/BJ6","v":1.5700892857142856},{"$f":"BK6","v":1.5700892857142856},2.39,{"$f":"3.517/BM6","v":1.4715481171548117},{"$f":"BN6","v":1.4715481171548117},2.04,{"$f":"3.517/BP6","v":1.7240196078431371},{"$f":"BQ6","v":1.7240196078431371},{"$f":"BS$36","v":1.99},{"$f":"3.517/BS6","v":1.7673366834170854},{"$f":"BT6","v":1.7673366834170854}]
[1991,2.2000000000000002,1.5986363636363634,{"$f":"C7","v":1.5986363636363634},2.1,{"$f":"3.517/E7","v":1.6747619047619047},{"$f":"F7","v":1.6747619047619047},1.9,{"$f":"3.517/H7","v":1.8510526315789475},{"$f":"I7","v":1.8510526315789475},2.6,{"$f":"3.517/K7","v":1.3526923076923076},{"$f":"L7","v":1.3526923076923076},2.5,{"$f":"3.517/N7","v":1.4068000000000001},{"$f":"O7","v":1.4068000000000001},2.4,{"$f":"3.517/Q7","v":1.4654166666666666},{"$f":"R7","v":1.4654166666666666},2.5499999999999998,{"$f":"3.517/T7","v":1.37921568627451},{"$f":"U7","v":1.37921568627451},2.4500000000000002,{"$f":"3.517/W7","v":1.4355102040816325},{"$f":"X7","v":1.4355102040816325},2.35,{"$f":"3.517/Z7","v":1.4965957446808509},{"$f":"AA7","v":1.4965957446808509},2.5,{"$f":"3.517/AC7","v":1.4068000000000001},{"$f":"AD7","v":1.4068000000000001},2.15,{"$f":"3.517/AF7","v":1.6358139534883722},{"$f":"AG7","v":1.6358139534883722},2.1,{"$f":"3.517/AI7","v":1.6747619047619047},{"$f":"AJ7","v":1.6747619047619047},2.09,{"$f":"3.517/AL7","v":1.6827751196172249},{"$f":"AM7","v":1.6827751196172249},1.99,{"$f":"3.517/AO7","v":1.7673366834170854},{"$f":"AP7","v":1.7673366834170854},1.79,{"$f":"3.517/AR7","v":1.964804469273743},{"$f":"AS7","v":1.964804469273743},2.4900000000000002,{"$f":"3.517/AU7","v":1.412449799196787},{"$f":"AV7","v":1.412449799196787},2.39,{"$f":"3.517/AX7","v":1.4715481171548117},{"$f":"AY7","v":1.4715481171548117},2.29,{"$f":"3.517/BA7","v":1.5358078602620087},{"$f":"BB7","v":1.5358078602620087},2.44,{"$f":"3.517/BD7","v":1.4413934426229509},{"$f":"BE7","v":1.4413934426229509},2.34,{"$f":"3.517/BG7","v":1.502991452991453},{"$f":"BH7","v":1.502991452991453},2.2400000000000002,{"$f":"3.517/BJ7","v":1.5700892857142856},{"$f":"BK7","v":1.5700892857142856},2.39,{"$f":"3.517/BM7","v":1.4715481171548117},{"$f":"BN7","v":1.4715481171548117},2.04,{"$f":"3.517/BP7","v":1.7240196078431371},{"$f":"BQ7","v":1.7240196078431371},1.99,{"$f":"3.517/BS7","v":1.7673366834170854},{"$f":"BT7","v":1.7673366834170854}]
[1992,2.2000000000000002,1.5986363636363634,1.5986363636363634,2.1,{"$f":"3.517/E8","v":1.6747619047619047},1.6747619047619047,1.9,{"$f":"3.517/H8","v":1.8510526315789475},1.8510526315789475,2.6,{"$f":"3.517/K8","v":1.3526923076923076},1.3526923076923076,2.5,{"$f":"3.517/N8","v":1.4068000000000001},1.4068000000000001,2.4,{"$f":"3.517/Q8","v":1.4654166666666666},1.4654166666666666,2.5499999999999998,{"$f":"3.517/T8","v":1.37921568627451},1.37921568627451,2.4500000000000002,{"$f":"3.517/W8","v":1.4355102040816325},1.4355102040816325,2.35,{"$f":"3.517/Z8","v":1.4965957446808509},1.4965957446808509,2.5,{"$f":"3.517/AC8","v":1.4068000000000001},1.4068000000000001,2.15,{"$f":"3.517/AF8","v":1.6358139534883722},1.6358139534883722,2.1,{"$f":"3.517/AI8","v":1.6747619047619047},1.6747619047619047,2.09,{"$f":"3.517/AL8","v":1.6827751196172249},1.6827751196172249,1.99,{"$f":"3.517/AO8","v":1.7673366834170854},1.7673366834170854,1.79,{"$f":"3.517/AR8","v":1.964804469273743},1.964804469273743,2.4900000000000002,{"$f":"3.517/AU8","v":1.412449799196787},1.412449799196787,2.39,{"$f":"3.517/AX8","v":1.4715481171548117},1.4715481171548117,2.29,{"$f":"3.517/BA8","v":1.5358078602620087},1.5358078602620087,2.44,{"$f":"3.517/BD8","v":1.4413934426229509},1.4413934426229509,2.34,{"$f":"3.517/BG8","v":1.502991452991453},1.502991452991453,2.2400000000000002,{"$f":"3.517/BJ8","v":1.5700892857142856},1.5700892857142856,2.39,{"$f":"3.517/BM8","v":1.4715481171548117},1.4715481171548117,2.04,{"$f":"3.517/BP8","v":1.7240196078431371},1.7240196078431371,1.99,{"$f":"3.517/BS8","v":1.7673366834170854},1.7673366834170854]
[1993,2.2000000000000002,1.5986363636363634,1.5986363636363634,2.1,{"$f":"3.517/E9","v":1.6747619047619047},1.6747619047619047,1.9,{"$f":"3.517/H9","v":1.8510526315789475},1.8510526315789475,2.6,{"$f":"3.517/K9","v":1.3526923076923076},1.3526923076923076,2.5,{"$f":"3.517/N9","v":1.4068000000000001},1.4068000000000001,2.4,{"$f":"3.517/Q9","v":1.4654166666666666},1.4654166666666666,2.5499999999999998,{"$f":"3.517/T9","v":1.37921568627451},1.37921568627451,2.4500000000000002,{"$f":"3.517/W9","v":1.4355102040816325},1.4355102040816325,2.35,{"$f":"3.517/Z9","v":1.4965957446808509},1.4965957446808509,2.5,{"$f":"3.517/AC9","v":1.4068000000000001},1.4068000000000001,2.15,{"$f":"3.517/AF9","v":1.6358139534883722},1.6358139534883722,2.1,{"$f":"3.517/AI9","v":1.6747619047619047},1.6747619047619047,2.09,{"$f":"3.517/AL9","v":1.6827751196172249},1.6827751196172249,1.99,{"$f":"3.517/AO9","v":1.7673366834170854},1.7673366834170854,1.79,{"$f":"3.517/AR9","v":1.964804469273743},1.964804469273743,2.4900000000000002,{"$f":"3.517/AU9","v":1.412449799196787},1.412449799196787,2.39,{"$f":"3.517/AX9","v":1.4715481171548117},1.4715481171548117,2.29,{"$f":"3.517/BA9","v":1.5358078602620087},1.5358078602620087,2.44,{"$f":"3.517/BD9","v":1.4413934426229509},1.4413934426229509,2.34,{"$f":"3.517/BG9","v":1.502991452991453},1.502991452991453,2.2400000000000002,{"$f":"3.517/BJ9","v":1.5700892857142856},1.5700892857142856,2.39,{"$f":"3.517/BM9","v":1.4715481171548117},1.4715481171548117,2.04,{"$f":"3.517/BP9","v":1.7240196078431371},1.7240196078431371,1.99,{"$f":"3.517/BS9","v":1.7673366834170854},1.7673366834170854]
[1994,2.2000000000000002,1.5986363636363634,1.5986363636363634,2.1,{"$f":"3.517/E10","v":1.6747619047619047},1.6747619047619047,1.9,{"$f":"3.517/H10","v":1.8510526315789475},1.8510526315789475,2.6,{"$f":"3.517/K10","v":1.3526923076923076},1.3526923076923076,2.5,{"$f":"3.517/N10","v":1.4068000000000001},1.4068000000000001,2.4,{"$f":"3.517/Q10","v":1.4654166666666666},1.4654166666666666,2.5499999999999998,{"$f":"3.517/T10","v":1.37921568627451},1.37921568627451,2.4500000000000002,{"$f":"3.517/W10","v":1.4355102040816325},1.4355102040816325,2.35,{"$f":"3.517/Z10","v":1.4965957446808509},1.4965957446808509,2.5,{"$f":"3.517/AC10","v":1.4068000000000001},1.4068000000000001,2.15,{"$f":"3.517/AF10","v":1.6358139534883722},1.6358139534883722,2.1,{"$f":"3.517/AI10","v":1.6747619047619047},1.6747619047619047,2.09,{"$f":"3.517/AL10","v":1.6827751196172249},1.6827751196172249,1.99,{"$f":"3.517/AO10","v":1.7673366834170854},1.7673366834170854,1.79,{"$f":"3.517/AR10","v":1.964804469273743},1.964804469273743,2.4900000000000002,{"$f":"3.517/AU10","v":1.412449799196787},1.412449799196787,2.39,{"$f":"3.517/AX10","v":1.4715481171548117},1.4715481171548117,2.29,{"$f":"3.517/BA10","v":1.5358078602620087},1.5358078602620087,2.44,{"$f":"3.517/BD10","v":1.4413934426229509},1.4413934426229509,2.34,{"$f":"3.517/BG10","v":1.502991452991453},1.502991452991453,2.2400000000000002,{"$f":"3.517/BJ10","v":1.5700892857142856},1.5700892857142856,2.39,{"$f":"3.517/BM10","v":1.4715481171548117},1.4715481171548117,2.04,{"$f":"3.517/BP10","v":1.7240196078431371},1.7240196078431371,1.99,{"$f":"3.517/BS10","v":1.7673366834170854},1.7673366834170854]
[1995,2.2000000000000002,1.5986363636363634,1.5986363636363634,2.1,{"$f":"3.517/E11","v":1.6747619047619047},1.6747619047619047,1.9,{"$f":"3.517/H11","v":1.8510526315789475},1.8510526315789475,2.6,{"$f":"3.517/K11","v":1.3526923076923076},1.3526923076923076,2.5,{"$f":"3.517/N11","v":1.4068000000000001},1.4068000000000001,2.4,{"$f":"3.517/Q11","v":1.4654166666666666},1.4654166666666666,2.5499999999999998,{"$f":"3.517/T11","v":1.37921568627451},1.37921568627451,2.4500000000000002,{"$f":"3.517/W11","v":1.4355102040816325},1.4355102040816325,2.35,{"$f":"3.517/Z11","v":1.4965957446808509},1.4965957446808509,2.5,{"$f":"3.517/AC11","v":1.4068000000000001},1.4068000000000001,2.15,{"$f":"3.517/AF11","v":1.6358139534883722},1.6358139534883722,2.1,{"$f":"3.517/AI11","v":1.6747619047619047},1.6747619047619047,2.09,{"$f":"3.517/AL11","v":1.6827751196172249},1.6827751196172249,1.99,{"$f":"3.517/AO11","v":1.7673366834170854},1.7673366834170854,1.79,{"$f":"3.517/AR11","v":1.964804469273743},1.964804469273743,2.4900000000000002,{"$f":"3.517/AU11","v":1.412449799196787},1.412449799196787,2.39,{"$f":"3.517/AX11","v":1.4715481171548117},1.4715481171548117,2.29,{"$f":"3.517/BA11","v":1.5358078602620087},1.5358078602620087,2.44,{"$f":"3.517/BD11","v":1.4413934426229509},1.4413934426229509,2.34,{"$f":"3.517/BG11","v":1.502991452991453},1.502991452991453,2.2400000000000002,{"$f":"3.517/BJ11","v":1.5700892857142856},1.5700892857142856,2.39,{"$f":"3.517/BM11","v":1.4715481171548117},1.4715481171548117,2.04,{"$f":"3.517/BP11","v":1.7240196078431371},1.7240196078431371,1.99,{"$f":"3.517/BS11","v":1.7673366834170854},1.7673366834170854]
[1996,2.2000000000000002,1.5986363636363634,1.5986363636363634,2.1,{"$f":"3.517/E12","v":1.6747619047619047},1.6747619047619047,1.9,{"$f":"3.517/H12","v":1.8510526315789475},1.8510526315789475,2.6,{"$f":"3.517/K12","v":1.3526923076923076},1.3526923076923076,2.5,{"$f":"3.517/N12","v":1.4068000000000001},1.4068000000000001,2.4,{"$f":"3.517/Q12","v":1.4654166666666666},1.4654166666666666,2.5499999999999998,{"$f":"3.517/T12","v":1.37921568627451},1.37921568627451,2.4500000000000002,{"$f":"3.517/W12","v":1.4355102040816325},1.4355102040816325,2.35,{"$f":"3.517/Z12","v":1.4965957446808509},1.4965957446808509,2.5,{"$f":"3.517/AC12","v":1.4068000000000001},1.4068000000000001,2.15,{"$f":"3.517/AF12","v":1.6358139534883722},1.6358139534883722,2.1,{"$f":"3.517/AI12","v":1.6747619047619047},1.6747619047619047,2.09,{"$f":"3.517/AL12","v":1.6827751196172249},1.6827751196172249,1.99,{"$f":"3.517/AO12","v":1.7673366834170854},1.7673366834170854,1.79,{"$f":"3.517/AR12","v":1.964804469273743},1.964804469273743,2.4900000000000002,{"$f":"3.517/AU12","v":1.412449799196787},1.412449799196787,2.39,{"$f":"3.517/AX12","v":1.4715481171548117},1.4715481171548117,2.29,{"$f":"3.517/BA12","v":1.5358078602620087},1.5358078602620087,2.44,{"$f":"3.517/BD12","v":1.4413934426229509},1.4413934426229509,2.34,{"$f":"3.517/BG12","v":1.502991452991453},1.502991452991453,2.2400000000000002,{"$f":"3.517/BJ12","v":1.5700892857142856},1.5700892857142856,2.39,{"$f":"3.517/BM12","v":1.4715481171548117},1.4715481171548117,2.04,{"$f":"3.517/BP12","v":1.7240196078431371},1.7240196078431371,1.99,{"$f":"3.517/BS12","v":1.7673366834170854},1.7673366834170854]
[1997,2.2000000000000002,1.5986363636363634,1.5986363636363634,2.1,{"$f":"3.517/E13","v":1.6747619047619047},1.6747619047619047,1.9,{"$f":"3.517/H13","v":1.8510526315789475},1.8510526315789475,2.6,{"$f":"3.517/K13","v":1.3526923076923076},1.3526923076923076,2.5,{"$f":"3.517/N13","v":1.4068000000000001},1.4068000000000001,2.4,{"$f":"3.517/Q13","v":1.4654166666666666},1.4654166666666666,2.5499999999999998,{"$f":"3.517/T13","v":1.37921568627451},1.37921568627451,2.4500000000000002,{"$f":"3.517/W13","v":1.4355102040816325},1.4355102040816325,2.35,{"$f":"3.517/Z13","v":1.4965957446808509},1.4965957446808509,2.5,{"$f":"3.517/AC13","v":1.4068000000000001},1.4068000000000001,2.15,{"$f":"3.517/AF13","v":1.6358139534883722},1.6358139534883722,2.1,{"$f":"3.517/AI13","v":1.6747619047619047},1.6747619047619047,2.09,{"$f":"3.517/AL13","v":1.6827751196172249},1.6827751196172249,1.99,{"$f":"3.517/AO13","v":1.7673366834170854},1.7673366834170854,1.79,{"$f":"3.517/AR13","v":1.964804469273743},1.964804469273743,2.4900000000000002,{"$f":"3.517/AU13","v":1.412449799196787},1.412449799196787,2.39,{"$f":"3.517/AX13","v":1.4715481171548117},1.4715481171548117,2.29,{"$f":"3.517/BA13","v":1.5358078602620087},1.5358078602620087,2.44,{"$f":"3.517/BD13","v":1.4413934426229509},1.4413934426229509,2.34,{"$f":"3.517/BG13","v":1.502991452991453},1.502991452991453,2.2400000000000002,{"$f":"3.517/BJ13","v":1.5700892857142856},1.5700892857142856,2.39,{"$f":"3.517/BM13","v":1.4715481171548117},1.4715481171548117,2.04,{"$f":"3.517/BP13","v":1.7240196078431371},1.7240196078431371,1.99,{"$f":"3.517/BS13","v":1.7673366834170854},1.7673366834170854]
[1998,2.2000000000000002,1.5986363636363634,1.5986363636363634,2.1,{"$f":"3.517/E14","v":1.6747619047619047},1.6747619047619047,1.9,{"$f":"3.517/H14","v":1.8510526315789475},1.8510526315789475,2.6,{"$f":"3.517/K14","v":1.3526923076923076},1.3526923076923076,2.5,{"$f":"3.517/N14","v":1.4068000000000001},1.4068000000000001,2.4,{"$f":"3.517/Q14","v":1.4654166666666666},1.4654166666666666,2.5499999999999998,{"$f":"3.517/T14","v":1.37921568627451},1.37921568627451,2.4500000000000002,{"$f":"3.517/W14","v":1.4355102040816325},1.4355102040816325,2.35,{"$f":"3.517/Z14","v":1.4965957446808509},1.4965957446808509,2.5,{"$f":"3.517/AC14","v":1.4068000000000001},1.4068000000000001,2.15,{"$f":"3.517/AF14","v":1.6358139534883722},1.6358139534883722,2.1,{"$f":"3.517/AI14","v":1.6747619047619047},1.6747619047619047,2.09,{"$f":"3.517/AL14","v":1.6827751196172249},1.6827751196172249,1.99,{"$f":"3.517/AO14","v":1.7673366834170854},1.7673366834170854,1.79,{"$f":"3.517/AR14","v":1.964804469273743},1.964804469273743,2.4900000000000002,{"$f":"3.517/AU14","v":1.412449799196787},1.412449799196787,2.39,{"$f":"3.517/AX14","v":1.4715481171548117},1.4715481171548117,2.29,{"$f":"3.517/BA14","v":1.5358078602620087},1.5358078602620087,2.44,{"$f":"3.517/BD14","v":1.4413934426229509},1.4413934426229509,2.34,{"$f":"3.517/BG14","v":1.502991452991453},1.502991452991453,2.2400000000000002,{"$f":"3.517/BJ14","v":1.5700892857142856},1.5700892857142856,2.39,{"$f":"3.517/BM14","v":1.4715481171548117},1.4715481171548117,2.04,{"$f":"3.517/BP14","v":1.7240196078431371},1.7240196078431371,1.99,{"$f":"3.517/BS14","v":1.7673366834170854},1.7673366834170854]
[1999,2.2000000000000002,1.5986363636363634,1.5986363636363634,2.1,{"$f":"3.517/E15","v":1.6747619047619047},1.6747619047619047,1.9,{"$f":"3.517/H15","v":1.8510526315789475},1.8510526315789475,2.6,{"$f":"3.517/K15","v":1.3526923076923076},1.3526923076923076,2.5,{"$f":"3.517/N15","v":1.4068000000000001},1.4068000000000001,2.4,{"$f":"3.517/Q15","v":1.4654166666666666},1.4654166666666666,2.5499999999999998,{"$f":"3.517/T15","v":1.37921568627451},1.37921568627451,2.4500000000000002,{"$f":"3.517/W15","v":1.4355102040816325},1.4355102040816325,2.35,{"$f":"3.517/Z15","v":1.4965957446808509},1.4965957446808509,2.5,{"$f":"3.517/AC15","v":1.4068000000000001},1.4068000000000001,2.15,{"$f":"3.517/AF15","v":1.6358139534883722},1.6358139534883722,2.1,{"$f":"3.517/AI15","v":1.6747619047619047},1.6747619047619047,2.09,{"$f":"3.517/AL15","v":1.6827751196172249},1.6827751196172249,1.99,{"$f":"3.517/AO15","v":1.7673366834170854},1.7673366834170854,1.79,{"$f":"3.517/AR15","v":1.964804469273743},1.964804469273743,2.4900000000000002,{"$f":"3.517/AU15","v":1.412449799196787},1.412449799196787,2.39,{"$f":"3.517/AX15","v":1.4715481171548117},1.4715481171548117,2.29,{"$f":"3.517/BA15","v":1.5358078602620087},1.5358078602620087,2.44,{"$f":"3.517/BD15","v":1.4413934426229509},1.4413934426229509,2.34,{"$f":"3.517/BG15","v":1.502991452991453},1.502991452991453,2.2400000000000002,{"$f":"3.517/BJ15","v":1.5700892857142856},1.5700892857142856,2.39,{"$f":"3.517/BM15","v":1.4715481171548117},1.4715481171548117,2.04,{"$f":"3.517/BP15","v":1.7240196078431371},1.7240196078431371,1.99,{"$f":"3.517/BS15","v":1.7673366834170854},1.7673366834170854]
[2000,2.2000000000000002,1.5986363636363634,1.5986363636363634,2.1,{"$f":"3.517/E16","v":1.6747619047619047},1.6747619047619047,1.9,{"$f":"3.517/H16","v":1.8510526315789475},1.8510526315789475,2.6,{"$f":"3.517/K16","v":1.3526923076923076},1.3526923076923076,2.5,{"$f":"3.517/N16","v":1.4068000000000001},1.4068000000000001,2.4,{"$f":"3.517/Q16","v":1.4654166666666666},1.4654166666666666,2.5499999999999998,{"$f":"3.517/T16","v":1.37921568627451},1.37921568627451,2.4500000000000002,{"$f":"3.517/W16","v":1.4355102040816325},1.4355102040816325,2.35,{"$f":"3.517/Z16","v":1.4965957446808509},1.4965957446808509,2.5,{"$f":"3.517/AC16","v":1.4068000000000001},1.4068000000000001,2.15,{"$f":"3.517/AF16","v":1.6358139534883722},1.6358139534883722,2.1,{"$f":"3.517/AI16","v":1.6747619047619047},1.6747619047619047,2.09,{"$f":"3.517/AL16","v":1.6827751196172249},1.6827751196172249,1.99,{"$f":"3.517/AO16","v":1.7673366834170854},1.7673366834170854,1.79,{"$f":"3.517/AR16","v":1.964804469273743},1.964804469273743,2.4900000000000002,{"$f":"3.517/AU16","v":1.412449799196787},1.412449799196787,2.39,{"$f":"3.517/AX16","v":1.4715481171548117},1.4715481171548117,2.29,{"$f":"3.517/BA16","v":1.5358078602620087},1.5358078602620087,2.44,{"$f":"3.517/BD16","v":1.4413934426229509},1.4413934426229509,2.34,{"$f":"3.517/BG16","v":1.502991452991453},1.502991452991453,2.2400000000000002,{"$f":"3.517/BJ16","v":1.5700892857142856},1.5700892857142856,2.39,{"$f":"3.517/BM16","v":1.4715481171548117},1.4715481171548117,2.04,{"$f":"3.517/BP16","v":1.7240196078431371},1.7240196078431371,1.99,{"$f":"3.517/BS16","v":1.7673366834170854},1.7673366834170854]
[2001,2.2000000000000002,1.5986363636363634,1.5986363636363634,2.1,{"$f":"3.517/E17","v":1.6747619047619047},1.6747619047619047,1.9,{"$f":"3.517/H17","v":1.8510526315789475},1.8510526315789475,2.6,{"$f":"3.517/K17","v":1.3526923076923076},1.3526923076923076,2.5,{"$f":"3.517/N17","v":1.4068000000000001},1.4068000000000001,2.4,{"$f":"3.517/Q17","v":1.4654166666666666},1.4654166666666666,2.5499999999999998,{"$f":"3.517/T17","v":1.37921568627451},1.37921568627451,2.4500000000000002,{"$f":"3.517/W17","v":1.4355102040816325},1.4355102040816325,2.35,{"$f":"3.517/Z17","v":1.4965957446808509},1.4965957446808509,2.5,{"$f":"3.517/AC17","v":1.4068000000000001},1.4068000000000001,{"$f":"AF$36","v":2.15},{"$f":"3.517/AF17","v":1.6358139534883722},1.6358139534883722,2.1,{"$f":"3.517/AI17","v":1.6747619047619047},1.6747619047619047,2.09,{"$f":"3.517/AL17","v":1.6827751196172249},1.6827751196172249,1.99,{"$f":"3.517/AO17","v":1.7673366834170854},1.7673366834170854,1.79,{"$f":"3.517/AR17","v":1.964804469273743},1.964804469273743,2.4900000000000002,{"$f":"3.517/AU17","v":1.412449799196787},1.412449799196787,2.39,{"$f":"3.517/AX17","v":1.4715481171548117},1.4715481171548117,2.29,{"$f":"3.517/BA17","v":1.5358078602620087},1.5358078602620087,2.44,{"$f":"3.517/BD17","v":1.4413934426229509},1.4413934426229509,2.34,{"$f":"3.517/BG17","v":1.502991452991453},1.502991452991453,2.2400000000000002,{"$f":"3.517/BJ17","v":1.5700892857142856},1.5700892857142856,2.39,{"$f":"3.517/BM17","v":1.4715481171548117},1.4715481171548117,2.04,{"$f":"3.517/BP17","v":1.7240196078431371},1.7240196078431371,1.99,{"$f":"3.517/BS17","v":1.7673366834170854},1.7673366834170854]
[2002,2.2000000000000002,1.5986363636363634,1.5986363636363634,2.1,{"$f":"3.517/E18","v":1.6747619047619047},1.6747619047619047,1.9,{"$f":"3.517/H18","v":1.8510526315789475},1.8510526315789475,2.6,{"$f":"3.517/K18","v":1.3526923076923076},1.3526923076923076,2.5,{"$f":"3.517/N18","v":1.4068000000000001},1.4068000000000001,2.4,{"$f":"3.517/Q18","v":1.4654166666666666},1.4654166666666666,2.5499999999999998,{"$f":"3.517/T18","v":1.37921568627451},1.37921568627451,2.4500000000000002,{"$f":"3.517/W18","v":1.4355102040816325},1.4355102040816325,2.35,{"$f":"3.517/Z18","v":1.4965957446808509},1.4965957446808509,2.5,{"$f":"3.517/AC18","v":1.4068000000000001},1.4068000000000001,2.15,{"$f":"3.517/AF18","v":1.6358139534883722},1.6358139534883722,2.1,{"$f":"3.517/AI18","v":1.6747619047619047},1.6747619047619047,2.09,{"$f":"3.517/AL18","v":1.6827751196172249},1.6827751196172249,1.99,{"$f":"3.517/AO18","v":1.7673366834170854},1.7673366834170854,1.79,{"$f":"3.517/AR18","v":1.964804469273743},1.964804469273743,2.4900000000000002,{"$f":"3.517/AU18","v":1.412449799196787},1.412449799196787,2.39,{"$f":"3.517/AX18","v":1.4715481171548117},1.4715481171548117,2.29,{"$f":"3.517/BA18","v":1.5358078602620087},1.5358078602620087,2.44,{"$f":"3.517/BD18","v":1.4413934426229509},1.4413934426229509,2.34,{"$f":"3.517/BG18","v":1.502991452991453},1.502991452991453,2.2400000000000002,{"$f":"3.517/BJ18","v":1.5700892857142856},1.5700892857142856,2.39,{"$f":"3.517/BM18","v":1.4715481171548117},1.4715481171548117,2.04,{"$f":"3.517/BP18","v":1.7240196078431371},1.7240196078431371,1.99,{"$f":"3.517/BS18","v":1.7673366834170854},1.7673366834170854]
[2003,2.2000000000000002,1.5986363636363634,1.5986363636363634,2.1,{"$f":"3.517/E19","v":1.6747619047619047},1.6747619047619047,1.9,{"$f":"3.517/H19","v":1.8510526315789475},1.8510526315789475,2.6,{"$f":"3.517/K19","v":1.3526923076923076},1.3526923076923076,2.5,{"$f":"3.517/N19","v":1.4068000000000001},1.4068000000000001,2.4,{"$f":"3.517/Q19","v":1.4654166666666666},1.4654166666666666,2.5499999999999998,{"$f":"3.517/T19","v":1.37921568627451},1.37921568627451,2.4500000000000002,{"$f":"3.517/W19","v":1.4355102040816325},1.4355102040816325,2.35,{"$f":"3.517/Z19","v":1.4965957446808509},1.4965957446808509,2.5,{"$f":"3.517/AC19","v":1.4068000000000001},1.4068000000000001,2.15,{"$f":"3.517/AF19","v":1.6358139534883722},1.6358139534883722,2.1,{"$f":"3.517/AI19","v":1.6747619047619047},1.6747619047619047,2.09,{"$f":"3.517/AL19","v":1.6827751196172249},1.6827751196172249,1.99,{"$f":"3.517/AO19","v":1.7673366834170854},1.7673366834170854,1.79,{"$f":"3.517/AR19","v":1.964804469273743},1.964804469273743,2.4900000000000002,{"$f":"3.517/AU19","v":1.412449799196787},1.412449799196787,2.39,{"$f":"3.517/AX19","v":1.4715481171548117},1.4715481171548117,2.29,{"$f":"3.517/BA19","v":1.5358078602620087},1.5358078602620087,2.44,{"$f":"3.517/BD19","v":1.4413934426229509},1.4413934426229509,2.34,{"$f":"3.517/BG19","v":1.502991452991453},1.502991452991453,2.2400000000000002,{"$f":"3.517/BJ19","v":1.5700892857142856},1.5700892857142856,2.39,{"$f":"3.517/BM19","v":1.4715481171548117},1.4715481171548117,2.04,{"$f":"3.517/BP19","v":1.7240196078431371},1.7240196078431371,1.99,{"$f":"3.517/BS19","v":1.7673366834170854},1.7673366834170854]
[2004,2.2000000000000002,1.5986363636363634,1.5986363636363634,2.1,{"$f":"3.517/E20","v":1.6747619047619047},1.6747619047619047,1.9,{"$f":"3.517/H20","v":1.8510526315789475},1.8510526315789475,2.6,{"$f":"3.517/K20","v":1.3526923076923076},1.3526923076923076,2.5,{"$f":"3.517/N20","v":1.4068000000000001},1.4068000000000001,2.4,{"$f":"3.517/Q20","v":1.4654166666666666},1.4654166666666666,2.5499999999999998,{"$f":"3.517/T20","v":1.37921568627451},1.37921568627451,2.4500000000000002,{"$f":"3.517/W20","v":1.4355102040816325},1.4355102040816325,2.35,{"$f":"3.517/Z20","v":1.4965957446808509},1.4965957446808509,2.5,{"$f":"3.517/AC20","v":1.4068000000000001},1.4068000000000001,2.15,{"$f":"3.517/AF20","v":1.6358139534883722},1.6358139534883722,2.1,{"$f":"3.517/AI20","v":1.6747619047619047},1.6747619047619047,2.09,{"$f":"3.517/AL20","v":1.6827751196172249},1.6827751196172249,1.99,{"$f":"3.517/AO20","v":1.7673366834170854},1.7673366834170854,1.79,{"$f":"3.517/AR20","v":1.964804469273743},1.964804469273743,2.4900000000000002,{"$f":"3.517/AU20","v":1.412449799196787},1.412449799196787,2.39,{"$f":"3.517/AX20","v":1.4715481171548117},1.4715481171548117,2.29,{"$f":"3.517/BA20","v":1.5358078602620087},1.5358078602620087,2.44,{"$f":"3.517/BD20","v":1.4413934426229509},1.4413934426229509,2.34,{"$f":"3.517/BG20","v":1.502991452991453},1.502991452991453,2.2400000000000002,{"$f":"3.517/BJ20","v":1.5700892857142856},1.5700892857142856,2.39,{"$f":"3.517/BM20","v":1.4715481171548117},1.4715481171548117,2.04,{"$f":"3.517/BP20","v":1.7240196078431371},1.7240196078431371,1.99,{"$f":"3.517/BS20","v":1.7673366834170854},1.7673366834170854]
[2005,2.2000000000000002,1.5986363636363634,1.5986363636363634,2.1,{"$f":"3.517/E21","v":1.6747619047619047},1.6747619047619047,1.9,{"$f":"3.517/H21","v":1.8510526315789475},1.8510526315789475,2.6,{"$f":"3.517/K21","v":1.3526923076923076},1.3526923076923076,2.5,{"$f":"3.517/N21","v":1.4068000000000001},1.4068000000000001,2.4,{"$f":"3.517/Q21","v":1.4654166666666666},1.4654166666666666,2.5499999999999998,{"$f":"3.517/T21","v":1.37921568627451},1.37921568627451,2.4500000000000002,{"$f":"3.517/W21","v":1.4355102040816325},1.4355102040816325,2.35,{"$f":"3.517/Z21","v":1.4965957446808509},1.4965957446808509,2.5,{"$f":"3.517/AC21","v":1.4068000000000001},1.4068000000000001,2.15,{"$f":"3.517/AF21","v":1.6358139534883722},1.6358139534883722,2.1,{"$f":"3.517/AI21","v":1.6747619047619047},1.6747619047619047,2.09,{"$f":"3.517/AL21","v":1.6827751196172249},1.6827751196172249,1.99,{"$f":"3.517/AO21","v":1.7673366834170854},1.7673366834170854,1.79,{"$f":"3.517/AR21","v":1.964804469273743},1.964804469273743,2.4900000000000002,{"$f":"3.517/AU21","v":1.412449799196787},1.412449799196787,2.39,{"$f":"3.517/AX21","v":1.4715481171548117},1.4715481171548117,2.29,{"$f":"3.517/BA21","v":1.5358078602620087},1.5358078602620087,2.44,{"$f":"3.517/BD21","v":1.4413934426229509},1.4413934426229509,2.34,{"$f":"3.517/BG21","v":1.502991452991453},1.502991452991453,2.2400000000000002,{"$f":"3.517/BJ21","v":1.5700892857142856},1.5700892857142856,2.39,{"$f":"3.517/BM21","v":1.4715481171548117},1.4715481171548117,2.04,{"$f":"3.517/BP21","v":1.7240196078431371},1.7240196078431371,1.99,{"$f":"3.517/BS21","v":1.7673366834170854},1.7673366834170854]
[2006,2.2000000000000002,1.5986363636363634,1.5986363636363634,2.1,{"$f":"3.517/E22","v":1.6747619047619047},1.6747619047619047,1.9,{"$f":"3.517/H22","v":1.8510526315789475},1.8510526315789475,2.6,{"$f":"3.517/K22","v":1.3526923076923076},1.3526923076923076,2.5,{"$f":"3.517/N22","v":1.4068000000000001},1.4068000000000001,2.4,{"$f":"3.517/Q22","v":1.4654166666666666},1.4654166666666666,2.5499999999999998,{"$f":"3.517/T22","v":1.37921568627451},1.37921568627451,2.4500000000000002,{"$f":"3.517/W22","v":1.4355102040816325},1.4355102040816325,2.35,{"$f":"3.517/Z22","v":1.4965957446808509},1.4965957446808509,2.5,{"$f":"3.517/AC22","v":1.4068000000000001},1.4068000000000001,2.15,{"$f":"3.517/AF22","v":1.6358139534883722},1.6358139534883722,2.1,{"$f":"3.517/AI22","v":1.6747619047619047},1.6747619047619047,2.09,{"$f":"3.517/AL22","v":1.6827751196172249},1.6827751196172249,1.99,{"$f":"3.517/AO22","v":1.7673366834170854},1.7673366834170854,1.79,{"$f":"3.517/AR22","v":1.964804469273743},1.964804469273743,2.4900000000000002,{"$f":"3.517/AU22","v":1.412449799196787},1.412449799196787,2.39,{"$f":"3.517/AX22","v":1.4715481171548117},1.4715481171548117,2.29,{"$f":"3.517/BA22","v":1.5358078602620087},1.5358078602620087,2.44,{"$f":"3.517/BD22","v":1.4413934426229509},1.4413934426229509,2.34,{"$f":"3.517/BG22","v":1.502991452991453},1.502991452991453,2.2400000000000002,{"$f":"3.517/BJ22","v":1.5700892857142856},1.5700892857142856,2.39,{"$f":"3.517/BM22","v":1.4715481171548117},1.4715481171548117,2.04,{"$f":"3.517/BP22","v":1.7240196078431371},1.7240196078431371,{"$f":"BS$36","v":1.99},{"$f":"3.517/BS22","v":1.7673366834170854},1.7673366834170854]
[2007,2.2000000000000002,1.5986363636363634,1.5986363636363634,2.1,{"$f":"3.517/E23","v":1.6747619047619047},1.6747619047619047,1.9,{"$f":"3.517/H23","v":1.8510526315789475},1.8510526315789475,2.6,{"$f":"3.517/K23","v":1.3526923076923076},1.3526923076923076,2.5,{"$f":"3.517/N23","v":1.4068000000000001},1.4068000000000001,2.4,{"$f":"3.517/Q23","v":1.4654166666666666},1.4654166666666666,2.5499999999999998,{"$f":"3.517/T23","v":1.37921568627451},1.37921568627451,2.4500000000000002,{"$f":"3.517/W23","v":1.4355102040816325},1.4355102040816325,2.35,{"$f":"3.517/Z23","v":1.4965957446808509},1.4965957446808509,2.5,{"$f":"3.517/AC23","v":1.4068000000000001},1.4068000000000001,2.15,{"$f":"3.517/AF23","v":1.6358139534883722},1.6358139534883722,2.1,{"$f":"3.517/AI23","v":1.6747619047619047},1.6747619047619047,2.09,{"$f":"3.517/AL23","v":1.6827751196172249},1.6827751196172249,1.99,{"$f":"3.517/AO23","v":1.7673366834170854},1.7673366834170854,1.79,{"$f":"3.517/AR23","v":1.964804469273743},1.964804469273743,2.4900000000000002,{"$f":"3.517/AU23","v":1.412449799196787},1.412449799196787,2.39,{"$f":"3.517/AX23","v":1.4715481171548117},1.4715481171548117,2.29,{"$f":"3.517/BA23","v":1.5358078602620087},1.5358078602620087,2.44,{"$f":"3.517/BD23","v":1.4413934426229509},1.4413934426229509,2.34,{"$f":"3.517/BG23","v":1.502991452991453},1.502991452991453,2.2400000000000002,{"$f":"3.517/BJ23","v":1.5700892857142856},1.5700892857142856,2.39,{"$f":"3.517/BM23","v":1.4715481171548117},1.4715481171548117,2.04,{"$f":"3.517/BP23","v":1.7240196078431371},1.7240196078431371,1.99,{"$f":"3.517/BS23","v":1.7673366834170854},1.7673366834170854]
[2008,2.2000000000000002,1.5986363636363634,1.5986363636363634,2.1,{"$f":"3.517/E24","v":1.6747619047619047},1.6747619047619047,1.9,{"$f":"3.517/H24","v":1.8510526315789475},1.8510526315789475,2.6,{"$f":"3.517/K24","v":1.3526923076923076},1.3526923076923076,2.5,{"$f":"3.517/N24","v":1.4068000000000001},1.4068000000000001,2.4,{"$f":"3.517/Q24","v":1.4654166666666666},1.4654166666666666,2.5499999999999998,{"$f":"3.517/T24","v":1.37921568627451},1.37921568627451,2.4500000000000002,{"$f":"3.517/W24","v":1.4355102040816325},1.4355102040816325,2.35,{"$f":"3.517/Z24","v":1.4965957446808509},1.4965957446808509,2.5,{"$f":"3.517/AC24","v":1.4068000000000001},1.4068000000000001,2.15,{"$f":"3.517/AF24","v":1.6358139534883722},1.6358139534883722,2.1,{"$f":"3.517/AI24","v":1.6747619047619047},1.6747619047619047,2.09,{"$f":"3.517/AL24","v":1.6827751196172249},1.6827751196172249,1.99,{"$f":"3.517/AO24","v":1.7673366834170854},1.7673366834170854,1.79,{"$f":"3.517/AR24","v":1.964804469273743},1.964804469273743,2.4900000000000002,{"$f":"3.517/AU24","v":1.412449799196787},1.412449799196787,2.39,{"$f":"3.517/AX24","v":1.4715481171548117},1.4715481171548117,2.29,{"$f":"3.517/BA24","v":1.5358078602620087},1.5358078602620087,2.44,{"$f":"3.517/BD24","v":1.4413934426229509},1.4413934426229509,2.34,{"$f":"3.517/BG24","v":1.502991452991453},1.502991452991453,2.2400000000000002,{"$f":"3.517/BJ24","v":1.5700892857142856},1.5700892857142856,2.39,{"$f":"3.517/BM24","v":1.4715481171548117},1.4715481171548117,2.04,{"$f":"3.517/BP24","v":1.7240196078431371},1.7240196078431371,1.99,{"$f":"3.517/BS24","v":1.7673366834170854},1.7673366834170854]
[2009,2.2000000000000002,1.5986363636363634,1.5986363636363634,2.1,{"$f":"3.517/E25","v":1.6747619047619047},1.6747619047619047,1.9,{"$f":"3.517/H25","v":1.8510526315789475},1.8510526315789475,2.6,{"$f":"3.517/K25","v":1.3526923076923076},1.3526923076923076,2.5,{"$f":"3.517/N25","v":1.4068000000000001},1.4068000000000001,2.4,{"$f":"3.517/Q25","v":1.4654166666666666},1.4654166666666666,2.5499999999999998,{"$f":"3.517/T25","v":1.37921568627451},1.37921568627451,2.4500000000000002,{"$f":"3.517/W25","v":1.4355102040816325},1.4355102040816325,2.35,{"$f":"3.517/Z25","v":1.4965957446808509},1.4965957446808509,2.5,{"$f":"3.517/AC25","v":1.4068000000000001},1.4068000000000001,2.15,{"$f":"3.517/AF25","v":1.6358139534883722},1.6358139534883722,2.1,{"$f":"3.517/AI25","v":1.6747619047619047},1.6747619047619047,2.09,{"$f":"3.517/AL25","v":1.6827751196172249},1.6827751196172249,1.99,{"$f":"3.517/AO25","v":1.7673366834170854},1.7673366834170854,1.79,{"$f":"3.517/AR25","v":1.964804469273743},1.964804469273743,2.4900000000000002,{"$f":"3.517/AU25","v":1.412449799196787},1.412449799196787,2.39,{"$f":"3.517/AX25","v":1.4715481171548117},1.4715481171548117,2.29,{"$f":"3.517/BA25","v":1.5358078602620087},1.5358078602620087,2.44,{"$f":"3.517/BD25","v":1.4413934426229509},1.4413934426229509,2.34,{"$f":"3.517/BG25","v":1.502991452991453},1.502991452991453,2.2400000000000002,{"$f":"3.517/BJ25","v":1.5700892857142856},1.5700892857142856,2.39,{"$f":"3.517/BM25","v":1.4715481171548117},1.4715481171548117,2.04,{"$f":"3.517/BP25","v":1.7240196078431371},1.7240196078431371,1.99,{"$f":"3.517/BS25","v":1.7673366834170854},1.7673366834170854]
[2010,2.2000000000000002,1.5986363636363634,1.5986363636363634,2.1,{"$f":"3.517/E26","v":1.6747619047619047},1.6747619047619047,1.9,{"$f":"3.517/H26","v":1.8510526315789475},1.8510526315789475,2.6,{"$f":"3.517/K26","v":1.3526923076923076},1.3526923076923076,2.5,{"$f":"3.517/N26","v":1.4068000000000001},1.4068000000000001,2.4,{"$f":"3.517/Q26","v":1.4654166666666666},1.4654166666666666,2.5499999999999998,{"$f":"3.517/T26","v":1.37921568627451},1.37921568627451,2.4500000000000002,{"$f":"3.517/W26","v":1.4355102040816325},1.4355102040816325,2.35,{"$f":"3.517/Z26","v":1.4965957446808509},1.4965957446808509,2.5,{"$f":"3.517/AC26","v":1.4068000000000001},1.4068000000000001,2.15,{"$f":"3.517/AF26","v":1.6358139534883722},1.6358139534883722,2.1,{"$f":"3.517/AI26","v":1.6747619047619047},1.6747619047619047,2.09,{"$f":"3.517/AL26","v":1.6827751196172249},1.6827751196172249,1.99,{"$f":"3.517/AO26","v":1.7673366834170854},1.7673366834170854,1.79,{"$f":"3.517/AR26","v":1.964804469273743},1.964804469273743,2.4900000000000002,{"$f":"3.517/AU26","v":1.412449799196787},1.412449799196787,2.39,{"$f":"3.517/AX26","v":1.4715481171548117},1.4715481171548117,2.29,{"$f":"3.517/BA26","v":1.5358078602620087},1.5358078602620087,2.44,{"$f":"3.517/BD26","v":1.4413934426229509},1.4413934426229509,2.34,{"$f":"3.517/BG26","v":1.502991452991453},1.502991452991453,2.2400000000000002,{"$f":"3.517/BJ26","v":1.5700892857142856},1.5700892857142856,2.39,{"$f":"3.517/BM26","v":1.4715481171548117},1.4715481171548117,2.04,{"$f":"3.517/BP26","v":1.7240196078431371},1.7240196078431371,1.99,{"$f":"3.517/BS26","v":1.7673366834170854},1.7673366834170854]
[2011,2.2000000000000002,1.5986363636363634,1.5986363636363634,2.1,{"$f":"3.517/E27","v":1.6747619047619047},1.6747619047619047,1.9,{"$f":"3.517/H27","v":1.8510526315789475},1.8510526315789475,2.6,{"$f":"3.517/K27","v":1.3526923076923076},1.3526923076923076,2.5,{"$f":"3.517/N27","v":1.4068000000000001},1.4068000000000001,2.4,{"$f":"3.517/Q27","v":1.4654166666666666},1.4654166666666666,2.5499999999999998,{"$f":"3.517/T27","v":1.37921568627451},1.37921568627451,2.4500000000000002,{"$f":"3.517/W27","v":1.4355102040816325},1.4355102040816325,2.35,{"$f":"3.517/Z27","v":1.4965957446808509},1.4965957446808509,2.5,{"$f":"3.517/AC27","v":1.4068000000000001},1.4068000000000001,2.15,{"$f":"3.517/AF27","v":1.6358139534883722},1.6358139534883722,2.1,{"$f":"3.517/AI27","v":1.6747619047619047},1.6747619047619047,2.09,{"$f":"3.517/AL27","v":1.6827751196172249},1.6827751196172249,1.99,{"$f":"3.517/AO27","v":1.7673366834170854},1.7673366834170854,1.79,{"$f":"3.517/AR27","v":1.964804469273743},1.964804469273743,2.4900000000000002,{"$f":"3.517/AU27","v":1.412449799196787},1.412449799196787,2.39,{"$f":"3.517/AX27","v":1.4715481171548117},1.4715481171548117,2.29,{"$f":"3.517/BA27","v":1.5358078602620087},1.5358078602620087,2.44,{"$f":"3.517/BD27","v":1.4413934426229509},1.4413934426229509,2.34,{"$f":"3.517/BG27","v":1.502991452991453},1.502991452991453,2.2400000000000002,{"$f":"3.517/BJ27","v":1.5700892857142856},1.5700892857142856,2.39,{"$f":"3.517/BM27","v":1.4715481171548117},1.4715481171548117,2.04,{"$f":"3.517/BP27","v":1.7240196078431371},1.7240196078431371,1.99,{"$f":"3.517/BS27","v":1.7673366834170854},1.7673366834170854]
[2012,2.2000000000000002,1.5986363636363634,1.5986363636363634,2.1,{"$f":"3.517/E28","v":1.6747619047619047},1.6747619047619047,1.9,{"$f":"3.517/H28","v":1.8510526315789475},1.8510526315789475,2.6,{"$f":"3.517/K28","v":1.3526923076923076},1.3526923076923076,2.5,{"$f":"3.517/N28","v":1.4068000000000001},1.4068000000000001,2.4,{"$f":"3.517/Q28","v":1.4654166666666666},1.4654166666666666,2.5499999999999998,{"$f":"3.517/T28","v":1.37921568627451},1.37921568627451,2.4500000000000002,{"$f":"3.517/W28","v":1.4355102040816325},1.4355102040816325,2.35,{"$f":"3.517/Z28","v":1.4965957446808509},1.4965957446808509,2.5,{"$f":"3.517/AC28","v":1.4068000000000001},1.4068000000000001,2.15,{"$f":"3.517/AF28","v":1.6358139534883722},1.6358139534883722,2.1,{"$f":"3.517/AI28","v":1.6747619047619047},1.6747619047619047,{"$f":"AL$36","v":2.09},{"$f":"3.517/AL28","v":1.6827751196172249},1.6827751196172249,{"$f":"AO$36","v":1.99},{"$f":"3.517/AO28","v":1.7673366834170854},1.7673366834170854,{"$f":"AR$36","v":1.79},{"$f":"3.517/AR28","v":1.964804469273743},1.964804469273743,{"$f":"AU$36","v":2.4900000000000002},{"$f":"3.517/AU28","v":1.412449799196787},1.412449799196787,{"$f":"AX$36","v":2.39},{"$f":"3.517/AX28","v":1.4715481171548117},1.4715481171548117,{"$f":"BA$36","v":2.29},{"$f":"3.517/BA28","v":1.5358078602620087},1.5358078602620087,{"$f":"BD$36","v":2.44},{"$f":"3.517/BD28","v":1.4413934426229509},1.4413934426229509,{"$f":"BG$36","v":2.34},{"$f":"3.517/BG28","v":1.502991452991453},1.502991452991453,{"$f":"BJ$36","v":2.2400000000000002},{"$f":"3.517/BJ28","v":1.5700892857142856},1.5700892857142856,{"$f":"BM$36","v":2.39},{"$f":"3.517/BM28","v":1.4715481171548117},1.4715481171548117,{"$f":"BP$36","v":2.04},{"$f":"3.517/BP28","v":1.7240196078431371},1.7240196078431371,{"$f":"BS$36","v":1.99},{"$f":"3.517/BS28","v":1.7673366834170854},1.7673366834170854]
[2013,2.2000000000000002,{"$f":"3.517/B29","v":1.5986363636363634},{"$f":"C29","v":1.5986363636363634},2.1,{"$f":"3.517/E29","v":1.6747619047619047},{"$f":"F29","v":1.6747619047619047},1.9,{"$f":"3.517/H29","v":1.8510526315789475},{"$f":"I29","v":1.8510526315789475},2.6,{"$f":"3.517/K29","v":1.3526923076923076},{"$f":"L29","v":1.3526923076923076},2.5,{"$f":"3.517/N29","v":1.4068000000000001},{"$f":"O29","v":1.4068000000000001},2.4,{"$f":"3.517/Q29","v":1.4654166666666666},{"$f":"R29","v":1.4654166666666666},2.5499999999999998,{"$f":"3.517/T29","v":1.37921568627451},{"$f":"U29","v":1.37921568627451},2.4500000000000002,{"$f":"3.517/W29","v":1.4355102040816325},{"$f":"X29","v":1.4355102040816325},2.35,{"$f":"3.517/Z29","v":1.4965957446808509},{"$f":"AA29","v":1.4965957446808509},2.5,{"$f":"3.517/AC29","v":1.4068000000000001},{"$f":"AD29","v":1.4068000000000001},2.15,{"$f":"3.517/AF29","v":1.6358139534883722},{"$f":"AG29","v":1.6358139534883722},2.1,{"$f":"3.517/AI29","v":1.6747619047619047},{"$f":"AJ29","v":1.6747619047619047},2.09,{"$f":"3.517/AL29","v":1.6827751196172249},{"$f":"AM29","v":1.6827751196172249},1.99,{"$f":"3.517/AO29","v":1.7673366834170854},{"$f":"AP29","v":1.7673366834170854},1.79,{"$f":"3.517/AR29","v":1.964804469273743},{"$f":"AS29","v":1.964804469273743},2.4900000000000002,{"$f":"3.517/AU29","v":1.412449799196787},{"$f":"AV29","v":1.412449799196787},2.39,{"$f":"3.517/AX29","v":1.4715481171548117},{"$f":"AY29","v":1.4715481171548117},2.29,{"$f":"3.517/BA29","v":1.5358078602620087},{"$f":"BB29","v":1.5358078602620087},2.44,{"$f":"3.517/BD29","v":1.4413934426229509},{"$f":"BE29","v":1.4413934426229509},2.34,{"$f":"3.517/BG29","v":1.502991452991453},{"$f":"BH29","v":1.502991452991453},2.2400000000000002,{"$f":"3.517/BJ29","v":1.5700892857142856},{"$f":"BK29","v":1.5700892857142856},2.39,{"$f":"3.517/BM29","v":1.4715481171548117},{"$f":"BN29","v":1.4715481171548117},2.04,{"$f":"3.517/BP29","v":1.7240196078431371},{"$f":"BQ29","v":1.7240196078431371},1.99,{"$f":"3.517/BS29","v":1.7673366834170854},{"$f":"BT29","v":1.7673366834170854}]
[2014,{"$f":"B$36","v":2.2000000000000002},1.5986363636363634,1.5986363636363634,{"$f":"E$36","v":2.1},1.6747619047619047,1.6747619047619047,1.9,1.8510526315789475,1.8510526315789475,2.6,1.3526923076923076,1.3526923076923076,2.5,1.4068000000000001,1.4068000000000001,2.4,1.4654166666666666,1.4654166666666666,2.5499999999999998,1.37921568627451,1.37921568627451,{"$f":"W$36","v":2.4500000000000002},1.4355102040816325,1.4355102040816325,2.35,1.4965957446808509,1.4965957446808509,2.5,1.4068000000000001,1.4068000000000001,2.15,1.6358139534883722,1.6358139534883722,2.1,1.6747619047619047,1.6747619047619047,2.09,1.6827751196172249,1.6827751196172249,1.99,1.7673366834170854,1.7673366834170854,1.79,1.964804469273743,1.964804469273743,2.4900000000000002,1.412449799196787,1.412449799196787,2.39,1.4715481171548117,1.4715481171548117,2.29,1.5358078602620087,1.5358078602620087,2.44,1.4413934426229509,1.4413934426229509,2.34,1.502991452991453,1.502991452991453,2.2400000000000002,1.5700892857142856,1.5700892857142856,2.39,1.4715481171548117,1.4715481171548117,2.04,1.7240196078431371,1.7240196078431371,1.99,1.7673366834170854,1.7673366834170854]
[2015,2.2000000000000002,1.5986363636363634,1.5986363636363634,2.1,1.6747619047619047,1.6747619047619047,1.9,1.8510526315789475,1.8510526315789475,2.6,1.3526923076923076,1.3526923076923076,2.5,1.4068000000000001,1.4068000000000001,2.4,1.4654166666666666,1.4654166666666666,2.5499999999999998,1.37921568627451,1.37921568627451,2.4500000000000002,1.4355102040816325,1.4355102040816325,2.35,1.4965957446808509,1.4965957446808509,2.5,1.4068000000000001,1.4068000000000001,2.15,1.6358139534883722,1.6358139534883722,2.1,1.6747619047619047,1.6747619047619047,2.09,1.6827751196172249,1.6827751196172249,1.99,1.7673366834170854,1.7673366834170854,1.79,1.964804469273743,1.964804469273743,2.4900000000000002,1.412449799196787,1.412449799196787,2.39,1.4715481171548117,1.4715481171548117,2.29,1.5358078602620087,1.5358078602620087,2.44,1.4413934426229509,1.4413934426229509,2.34,1.502991452991453,1.502991452991453,2.2400000000000002,1.5700892857142856,1.5700892857142856,2.39,1.4715481171548117,1.4715481171548117,2.04,1.7240196078431371,1.7240196078431371,1.99,1.7673366834170854,1.7673366834170854]
[2016,2.2000000000000002,1.5986363636363634,1.5986363636363634,2.1,1.6747619047619047,1.6747619047619047,1.9,1.8510526315789475,1.8510526315789475,2.6,1.3526923076923076,1.3526923076923076,2.5,1.4068000000000001,1.4068000000000001,2.4,1.4654166666666666,1.4654166666666666,2.5499999999999998,1.37921568627451,1.37921568627451,2.4500000000000002,1.4355102040816325,1.4355102040816325,2.35,1.4965957446808509,1.4965957446808509,2.5,1.4068000000000001,1.4068000000000001,2.15,1.6358139534883722,1.6358139534883722,2.1,1.6747619047619047,1.6747619047619047,2.09,1.6827751196172249,1.6827751196172249,1.99,1.7673366834170854,1.7673366834170854,1.79,1.964804469273743,1.964804469273743,2.4900000000000002,1.412449799196787,1.412449799196787,2.39,1.4715481171548117,1.4715481171548117,2.29,1.5358078602620087,1.5358078602620087,2.44,1.4413934426229509,1.4413934426229509,2.34,1.502991452991453,1.502991452991453,2.2400000000000002,1.5700892857142856,1.5700892857142856,2.39,1.4715481171548117,1.4715481171548117,2.04,1.7240196078431371,1.7240196078431371,1.99,1.7673366834170854,1.7673366834170854]
[2017,2.2000000000000002,1.5986363636363634,1.5986363636363634,2.1,1.6747619047619047,1.6747619047619047,1.9,1.8510526315789475,1.8510526315789475,2.6,1.3526923076923076,1.3526923076923076,2.5,1.4068000000000001,1.4068000000000001,2.4,1.4654166666666666,1.4654166666666666,2.5499999999999998,1.37921568627451,1.37921568627451,2.4500000000000002,1.4355102040816325,1.4355102040816325,2.35,1.4965957446808509,1.4965957446808509,2.5,1.4068000000000001,1.4068000000000001,2.15,1.6358139534883722,1.6358139534883722,2.1,1.6747619047619047,1.6747619047619047,2.09,1.6827751196172249,1.6827751196172249,1.99,1.7673366834170854,1.7673366834170854,1.79,1.964804469273743,1.964804469273743,2.4900000000000002,1.412449799196787,1.412449799196787,2.39,1.4715481171548117,1.4715481171548117,2.29,1.5358078602620087,1.5358078602620087,2.44,1.4413934426229509,1.4413934426229509,2.34,1.502991452991453,1.502991452991453,2.2400000000000002,1.5700892857142856,1.5700892857142856,2.39,1.4715481171548117,1.4715481171548117,2.04,1.7240196078431371,1.7240196078431371,1.99,1.7673366834170854,1.7673366834170854]
[2018,2.2000000000000002,1.5986363636363634,1.5986363636363634,2.1,1.6747619047619047,1.6747619047619047,1.9,1.8510526315789475,1.8510526315789475,2.6,1.3526923076923076,1.3526923076923076,2.5,1.4068000000000001,1.4068000000000001,2.4,1.4654166666666666,1.4654166666666666,2.5499999999999998,1.37921568627451,1.37921568627451,2.4500000000000002,1.4355102040816325,1.4355102040816325,2.35,1.4965957446808509,1.4965957446808509,2.5,1.4068000000000001,1.4068000000000001,2.15,1.6358139534883722,1.6358139534883722,2.1,1.6747619047619047,1.6747619047619047,2.09,1.6827751196172249,1.6827751196172249,1.99,1.7673366834170854,1.7673366834170854,1.79,1.964804469273743,1.964804469273743,2.4900000000000002,1.412449799196787,1.412449799196787,2.39,1.4715481171548117,1.4715481171548117,2.29,1.5358078602620087,1.5358078602620087,2.44,1.4413934426229509,1.4413934426229509,2.34,1.502991452991453,1.502991452991453,2.2400000000000002,1.5700892857142856,1.5700892857142856,2.39,1.4715481171548117,1.4715481171548117,2.04,1.7240196078431371,1.7240196078431371,1.99,1.7673366834170854,1.7673366834170854]
["ARTRM8"]
["CPS",2.2000000000000002,{"$f":"3.517/B36","v":1.5986363636363634},1.5986363636363634,2.1,{"$f":"3.517/E36","v":1.6747619047619047},1.6747619047619047,1.9,{"$f":"3.517/H36","v":1.8510526315789475},1.8510526315789475,2.6,{"$f":"3.517/K36","v":1.3526923076923076},1.3526923076923076,2.5,{"$f":"3.517/N36","v":1.4068000000000001},1.4068000000000001,2.4,{"$f":"3.517/Q36","v":1.4654166666666666},1.4654166666666666,2.5499999999999998,{"$f":"3.517/T36","v":1.37921568627451},1.37921568627451,2.4500000000000002,{"$f":"3.517/W36","v":1.4355102040816325},1.4355102040816325,2.35,{"$f":"3.517/Z36","v":1.4965957446808509},1.4965957446808509,2.5,{"$f":"3.517/AC36","v":1.4068000000000001},1.4068000000000001,2.15,{"$f":"3.517/AF36","v":1.6358139534883722},1.6358139534883722,2.1,{"$f":"3.517/AI36","v":1.6747619047619047},1.6747619047619047,2.09,{"$f":"3.517/AL36","v":1.6827751196172249},1.6827751196172249,1.99,{"$f":"3.517/AO36","v":1.7673366834170854},1.7673366834170854,1.79,{"$f":"3.517/AR36","v":1.964804469273743},1.964804469273743,2.4900000000000002,{"$f":"3.517/AU36","v":1.412449799196787},1.412449799196787,2.39,{"$f":"3.517/AX36","v":1.4715481171548117},1.4715481171548117,2.29,{"$f":"3.517/BA36","v":1.5358078602620087},1.5358078602620087,2.44,{"$f":"3.517/BD36","v":1.4413934426229509},1.4413934426229509,2.34,{"$f":"3.517/BG36","v":1.502991452991453},1.502991452991453,2.2400000000000002,{"$f":"3.517/BJ36","v":1.5700892857142856},1.5700892857142856,2.39,{"$f":"3.517/BM36","v":1.4715481171548117},1.4715481171548117,2.04,{"$f":"3.517/BP36","v":1.7240196078431371},1.7240196078431371,1.99,{"$f":"3.517/BS36","v":1.7673366834170854},1.7673366834170854]
[]
[null,"SCOP conversion test:"]
[null,"Capacity",null,"efficiency",null,"EFLH","Energy"]
[null,20000,"btuh",2.2000000000000002,"SCOP",2000,{"$f":"(B40/D40)*F40/3412","v":5328.7861025258444}]
[null,{"$f":"B40/12000","v":1.6666666666666667},"ton",{"$f":"3.517/D40","v":1.5986363636363634},"kW/ton",2000,{"$f":"B41*D41*F41","v":5328.7878787878781}]

{"sheet":"Equipment Lookups","index":15,"n_rows":71,"n_cols":71,"rows_kept":71,"cut":false,"hidden":true,"merged":[]}
[]
[null,null,null,null,null,null,null,null,null,"kBtuh",null,0,6000,8000,11000,14000,17000,20000,25000,65000,135000,240000,760000]
[null,"ReplacementType",null,"ManufYear",null,"LAEquipment Type",null,"WaterCooledChiller",null,"Tons",null,null,null,null,null,null,null,null,null,null,null,null,null,75,150,300,400,600,null,null,null,"RUL"]
[null,"Early Retirement",null,"Unknown",null,"Air Cooled Chiller",null,"Screw/Scroll/Reciprocating",null,"kbtuh to use",1,{"$f":"IF(L2=0,L3*12000,L2)","v":0},6000,{"$f":"IF(N2=0,N3*12000,N2)","v":8000},11000,{"$f":"IF(P2=0,P3*12000,P2)","v":14000},{"$f":"IF(Q2=0,Q3*12000,Q2)","v":17000},{"$f":"IF(R2=0,R3*12000,R2)","v":20000},25000,{"$f":"IF(T2=0,T3*12000,T2)","v":65000},135000,240000,760000,900000,{"$f":"IF(Y2=0,Y3*12000,Y2)","v":1800000},{"$f":"IF(Z2=0,Z3*12000,Z2)","v":3600000},4800000,7200000,"Assumed Age","New Eq Type for TX EFLH","EUL",1,2,3,4,5,6,7,8,9,10,11,12,13,14,15,16,17,18,19,20,21,22,23,24,25,26,27,28,29,30,31,32,33,34,35,36,37,38,39,40]
[null,"New Construction",null,1990,null,"Water Cooled Chiller",null,"Centrifugal",null,"AirCooledChillerCentrifugal",{"$f":"K4+1","v":2},"Lessthan150tons","Lessthan150tons","Lessthan150tons","Lessthan150tons","Lessthan150tons","Lessthan150tons","Lessthan150tons","Lessthan150tons","Lessthan150tons","Lessthan150tons","Lessthan150tons","Lessthan150tons","Lessthan150tons","Greaterthan150tons","Greaterthan150tons","Greaterthan150tons","Greaterthan150tons",26,"Air Cooled Chiller",25,23.9,22.9,21.9,20.9,19.899999999999999,18.899999999999999,17.899999999999999,16.899999999999999,15.9,14.9,13.9,12.9,11.9,10.9,10.1,9.3000000000000007,8.6999999999999993,8.1,7.5,7.1,6.6,6.3,5.9,5.6,5.4,5,4,3,2,1,0,0,0,0,0,0,0,0,0,0]
[null,"Replace on Burnout",null,1991,null,"Unitary Air Conditioner",null,null,null,"AirCooledChillerScrewScrollReciprocating",{"$f":"K5+1","v":3},"Lessthan150tons","Lessthan150tons","Lessthan150tons","Lessthan150tons","Lessthan150tons","Lessthan150tons","Lessthan150tons","Lessthan150tons","Lessthan150tons","Lessthan150tons","Lessthan150tons","Lessthan150tons","Lessthan150tons","Greaterthan150tons","Greaterthan150tons","Greaterthan150tons","Greaterthan150tons",21,"Air Cooled Chiller",20,18.7,17.7,16.7,15.7,14.7,13.7,12.7,11.8,10.9,10,9.1,8.3000000000000007,7.5,6.8,6.2,5.5,5,4.5,4,3.6,3,2,1,0,0,0,0,0,0,0,0,0,0,0,0,0,0,0,0,0]
[null,null,null,1992,null,"Unitary Heat Pump",null,"AirCooledChiller",null,"WaterCooledChillerCentrifugal",4,"Lessthan150tons","Lessthan150tons","Lessthan150tons","Lessthan150tons","Lessthan150tons","Lessthan150tons","Lessthan150tons","Lessthan150tons","Lessthan150tons","Lessthan150tons","Lessthan150tons","Lessthan150tons","Lessthan150tons","150to300tons","300to400tons","400to600tons","Greaterthan600tons",26,"Water Cooled Chiller",25,23.9,22.9,21.9,20.9,19.899999999999999,18.899999999999999,17.899999999999999,16.899999999999999,15.9,14.9,13.9,12.9,11.9,10.9,10.1,9.3000000000000007,8.6999999999999993,8.1,7.5,7.1,6.6,6.3,5.9,5.6,5.4,5,4,3,2,1,0,0,0,0,0,0,0,0,0,0]
[null,null,null,1993,null,"Packaged Terminal Air Conditioner",null,"Screw/Scroll/Reciprocating",null,"WaterCooledChillerScrewScrollReciprocating",5,"Lessthan75tons","Lessthan75tons","Lessthan75tons","Lessthan75tons","Lessthan75tons","Lessthan75tons","Lessthan75tons","Lessthan75tons","Lessthan75tons","Lessthan75tons","Lessthan75tons","Lessthan75tons","75to150tons","150to300tons","300to600tons","300to600tons","Greaterthan600tons",21,"Water Cooled Chiller",20,18.7,17.7,16.7,15.7,14.7,13.7,12.7,11.8,10.9,10,9.1,8.3000000000000007,7.5,6.8,6.2,5.5,5,4.5,4,3.6,3,2,1,0,0,0,0,0,0,0,0,0,0,0,0,0,0,0,0,0]
[null,null,null,1994,null,"Packaged Terminal Heat Pump",null,"Centrifugal",null,"UnitaryAirConditioner",6,"Lessthan65kbtuh","Lessthan65kbtuh","Lessthan65kbtuh","Lessthan65kbtuh","Lessthan65kbtuh","Lessthan65kbtuh","Lessthan65kbtuh","Lessthan65kbtuh","65to135kbtuh","135to240kbtuh","240to760kbtuh","Greaterthan760kbtuh","Greaterthan760kbtuh","Greaterthan760kbtuh","Greaterthan760kbtuh","Greaterthan760kbtuh","Greaterthan760kbtuh",17,"DX",15,14,13,12,11,10,9.1,8.1999999999999993,7.3,6.5,5.7,5,4.4000000000000004,3.8,3.3,2.8,2,1,0,0,0,0,0,0,0,0,0,0,0,0,0,0,0,0,0,0,0,0,0,0,0]
[null,null,null,1995,null,"Room Air Conditioner",null,null,null,"UnitaryAirConditionerSplit",7,"Lessthan65kbtuh","Lessthan65kbtuh","Lessthan65kbtuh","Lessthan65kbtuh","Lessthan65kbtuh","Lessthan65kbtuh","Lessthan65kbtuh","Lessthan65kbtuh","65to135kbtuh","135to240kbtuh","240to760kbtuh","Greaterthan760kbtuh","Greaterthan760kbtuh","Greaterthan760kbtuh","Greaterthan760kbtuh","Greaterthan760kbtuh","Greaterthan760kbtuh",17,"DX",15,14,13,12,11,10,9.1,8.1999999999999993,7.3,6.5,5.7,5,4.4000000000000004,3.8,3.3,2.8,2,1,0,0,0,0,0,0,0,0,0,0,0,0,0,0,0,0,0,0,0,0,0,0,0]
[null,null,null,1996,null,"VRF Air Conditioner",null,"RoomAirConditioner",null,"UnitaryAirConditionerPackaged",8,"Lessthan65kbtuh","Lessthan65kbtuh","Lessthan65kbtuh","Lessthan65kbtuh","Lessthan65kbtuh","Lessthan65kbtuh","Lessthan65kbtuh","Lessthan65kbtuh","65to135kbtuh","135to240kbtuh","240to760kbtuh","Greaterthan760kbtuh","Greaterthan760kbtuh","Greaterthan760kbtuh","Greaterthan760kbtuh","Greaterthan760kbtuh","Greaterthan760kbtuh",17,"DX",15,14,13,12,11,10,9.1,8.1999999999999993,7.3,6.5,5.7,5,4.4000000000000004,3.8,3.3,2.8,2,1,0,0,0,0,0,0,0,0,0,0,0,0,0,0,0,0,0,0,0,0,0,0,0]
[null,null,null,1997,null,"VRF Heat Pump",null,"Without Reverse Cycle / With Louvered Sides",null,"UnitaryHeatPump",9,"Lessthan65kbtuh","Lessthan65kbtuh","Lessthan65kbtuh","Lessthan65kbtuh","Lessthan65kbtuh","Lessthan65kbtuh","Lessthan65kbtuh","Lessthan65kbtuh","65to135kbtuh","135to240kbtuh","240to760kbtuh","Greaterthan760kbtuh","Greaterthan760kbtuh","Greaterthan760kbtuh","Greaterthan760kbtuh","Greaterthan760kbtuh","Greaterthan760kbtuh",17,"DX",15,14,13,12,11,10,9.1,8.1999999999999993,7.3,6.5,5.7,5,4.4000000000000004,3.8,3.3,2.8,2,1,0,0,0,0,0,0,0,0,0,0,0,0,0,0,0,0,0,0,0,0,0,0,0]
[null,null,null,1998,null,"Single Package Vertical Air Conditioner",null,"Without Reverse Cycle / Without Louvered Sides",null,"UnitaryHeatPumpSplit",10,"Lessthan65kbtuh","Lessthan65kbtuh","Lessthan65kbtuh","Lessthan65kbtuh","Lessthan65kbtuh","Lessthan65kbtuh","Lessthan65kbtuh","Lessthan65kbtuh","65to135kbtuh","135to240kbtuh","Greaterthan240kbtuh","Greaterthan240kbtuh","Greaterthan240kbtuh","Greaterthan240kbtuh","Greaterthan240kbtuh","Greaterthan240kbtuh","Greaterthan240kbtuh",17,"DX",15,14,13,12,11,10,9.1,8.1999999999999993,7.3,6.5,5.7,5,4.4000000000000004,3.8,3.3,2.8,2,1,0,0,0,0,0,0,0,0,0,0,0,0,0,0,0,0,0,0,0,0,0,0,0]
[null,null,null,1999,null,"Single Package Vertical Heat Pump",null,"With Reverse Cycle / With Louvered Sides",null,"UnitaryHeatPumpPackaged",11,"Lessthan65kbtuh","Lessthan65kbtuh","Lessthan65kbtuh","Lessthan65kbtuh","Lessthan65kbtuh","Lessthan65kbtuh","Lessthan65kbtuh","Lessthan65kbtuh","65to135kbtuh","135to240kbtuh","Greaterthan240kbtuh","Greaterthan240kbtuh","Greaterthan240kbtuh","Greaterthan240kbtuh","Greaterthan240kbtuh","Greaterthan240kbtuh","Greaterthan240kbtuh",17,"DX",15,14,13,12,11,10,9.1,8.1999999999999993,7.3,6.5,5.7,5,4.4000000000000004,3.8,3.3,2.8,2,1,0,0,0,0,0,0,0,0,0,0,0,0,0,0,0,0,0,0,0,0,0,0,0]
[null,null,null,2000,null,null,null,"With Reverse Cycle / Without Louvered Sides",null,"RoomAirConditionerWithoutReverseCycleWithLouveredSides",12,"Lessthan8ktbuh","Lessthan8ktbuh","8to14kbtuh","8to14kbtuh","14to20kbtuh","14to20kbtuh","20to25kbtuh","Greaterthan25kbtuh",null,null,null,null,null,null,null,null,null,11,"PTRoom",9,14,13,12,11,5.5,4.5,4,3,2.8,2.2000000000000002,1.8,1.5,1.3,1,2.8,2,1,0,0,0,0,0,0,0,0,0,0,0,0,0,0,0,0,0,0,0,0,0,0,0]
[null,null,null,2001,null,"MSEquipmentType",null,"Casement Only",null,"RoomAirConditionerWithoutReverseCycleWithoutLouveredSides",13,"Lessthan8ktbuh","Lessthan8ktbuh","8to11kbtuh","11to14kbtuh","14to20kbtuh","14to20kbtuh","Greaterthan20kbtuh","Greaterthan20kbtuh",null,null,null,null,null,null,null,null,null,11,"PTRoom",9,14,13,12,11,10,9.1,8.1999999999999993,7.3,6.5,5.7,5,4.4000000000000004,3.8,3.3,2.8,2,1,0,0,0,0,0,0,0,0,0,0,0,0,0,0,0,0,0,0,0,0,0,0,0]
[null,null,null,2002,null,"Air Cooled Chiller",null,"Casement Slider",null,"RoomAirConditionerWithReverseCycleWithLouveredSides",14,"Lessthan20kbtuh","Lessthan20kbtuh","Lessthan20kbtuh","Lessthan20kbtuh","Lessthan20kbtuh","Lessthan20kbtuh","Greaterthan20kbtuh","Greaterthan20kbtuh",null,null,null,null,null,null,null,null,null,11,"PTRoom",9,14,13,12,11,10,9.1,8.1999999999999993,7.3,6.5,5.7,5,4.4000000000000004,3.8,3.3,2.8,2,1,0,0,0,0,0,0,0,0,0,0,0,0,0,0,0,0,0,0,0,0,0,0,0]
[null,null,null,2003,null,"Water Cooled Chiller",null,null,null,"RoomAirConditionerWithReverseCycleWithoutLouveredSides",15,"Lessthan14kbtuh","Lessthan14kbtuh","Lessthan14kbtuh","Lessthan14kbtuh","Greaterthan14kbtuh","Greaterthan14kbtuh","Greaterthan14kbtuh","Greaterthan14kbtuh",null,null,null,null,null,null,null,null,null,11,"PTRoom",9,14,13,12,11,10,9.1,8.1999999999999993,7.3,6.5,5.7,5,4.4000000000000004,3.8,3.3,2.8,2,1,0,0,0,0,0,0,0,0,0,0,0,0,0,0,0,0,0,0,0,0,0,0,0]
[null,null,null,2004,null,"Unitary Air Conditioner",null,"PackagedTerminalAirConditioner",null,"RoomAirConditionerCasementOnly",16,"All","All","All","All","All","All","All","All","All","All","All","All","All","All","All","All","All",11,"PTRoom",9,14,13,12,11,10,9.1,8.1999999999999993,7.3,6.5,5.7,5,4.4000000000000004,3.8,3.3,2.8,2,1,0,0,0,0,0,0,0,0,0,0,0,0,0,0,0,0,0,0,0,0,0,0,0]
[null,null,null,2005,null,"Unitary Heat Pump",null,"Standard Size",null,"RoomAirConditionerCasementSlider",17,"All","All","All","All","All","All","All","All","All","All","All","All","All","All","All","All","All",11,"PTRoom",9,14,13,12,11,10,9.1,8.1999999999999993,7.3,6.5,5.7,5,4.4000000000000004,3.8,3.3,2.8,2,1,0,0,0,0,0,0,0,0,0,0,0,0,0,0,0,0,0,0,0,0,0,0,0]
[null,null,null,2006,null,"Packaged Terminal Air Conditioner",null,"Non Standard Size",null,"SinglePackageVerticalAirConditioner",18,"Lessthan65kbtuh","Lessthan65kbtuh","Lessthan65kbtuh","Lessthan65kbtuh","Lessthan65kbtuh","Lessthan65kbtuh","Lessthan65kbtuh","Lessthan65kbtuh","65to135kbtuh","135to240kbtuh",null,null,null,null,null,null,null,17,"DX",15,14,13,12,11,10,9.1,8.1999999999999993,7.3,6.5,5.7,5,4.4000000000000004,3.8,3.3,2.8,2,1,0,0,0,0,0,0,0,0,0,0,0,0,0,0,0,0,0,0,0,0,0,0,0]
[null,null,null,2007,null,"Packaged Terminal Heat Pump",null,null,null,"SinglePackageVerticalHeatPump",19,"Lessthan65kbtuh","Lessthan65kbtuh","Lessthan65kbtuh","Lessthan65kbtuh","Lessthan65kbtuh","Lessthan65kbtuh","Lessthan65kbtuh","Lessthan65kbtuh","65to135kbtuh","135to240kbtuh",null,null,null,null,null,null,null,17,"DX",15,14,13,12,11,10,9.1,8.1999999999999993,7.3,6.5,5.7,5,4.4000000000000004,3.8,3.3,2.8,2,1,0,0,0,0,0,0,0,0,0,0,0,0,0,0,0,0,0,0,0,0,0,0,0]
[null,null,null,2008,null,"Room Air Conditioner",null,"PackagedTerminalHeatPump",null,"VRFAirConditioner",20,"Lessthan65kbtuh","Lessthan65kbtuh","Lessthan65kbtuh","Lessthan65kbtuh","Lessthan65kbtuh","Lessthan65kbtuh","Lessthan65kbtuh","Lessthan65kbtuh","65to135kbtuh","135to240kbtuh","Greaterthan240kbtuh","Greaterthan240kbtuh","Greaterthan240kbtuh","Greaterthan240kbtuh","Greaterthan240kbtuh","Greaterthan240kbtuh","Greaterthan240kbtuh",17,"DX",15,14,13,12,11,10,9.1,8.1999999999999993,7.3,6.5,5.7,5,4.4000000000000004,3.8,3.3,2.8,2,1,0,0,0,0,0,0,0,0,0,0,0,0,0,0,0,0,0,0,0,0,0,0,0]
[null,null,null,2009,null,"VRF Air Conditioner",null,"Standard Size",null,"VRFHeatPump",21,"Lessthan65kbtuh","Lessthan65kbtuh","Lessthan65kbtuh","Lessthan65kbtuh","Lessthan65kbtuh","Lessthan65kbtuh","Lessthan65kbtuh","Lessthan65kbtuh",null,null,null,null,null,null,null,null,null,17,"DX",15,14,13,12,11,10,9.1,8.1999999999999993,7.3,6.5,5.7,5,4.4000000000000004,3.8,3.3,2.8,2,1,0,0,0,0,0,0,0,0,0,0,0,0,0,0,0,0,0,0,0,0,0,0,0]
[null,null,null,2010,null,"VRF Heat Pump",null,"Non Standard Size",null,"VRFHeatPumpwithHeatRecovery",22,null,null,null,null,null,null,null,null,"65to135kbtuh","135to240kbtuh","Greaterthan240kbtuh","Greaterthan240kbtuh","Greaterthan240kbtuh","Greaterthan240kbtuh","Greaterthan240kbtuh","Greaterthan240kbtuh","Greaterthan240kbtuh",17,"DX",15,14,13,12,11,10,9.1,8.1999999999999993,7.3,6.5,5.7,5,4.4000000000000004,3.8,3.3,2.8,2,1,0,0,0,0,0,0,0,0,0,0,0,0,0,0,0,0,0,0,0,0,0,0,0]
[null,null,null,2011,null,"Single Package Vertical Air Conditioner",null,null,null,"VRFHeatPumpwithoutHeatRecovery",23,null,null,null,null,null,null,null,null,"65to135kbtuh","135to240kbtuh","Greaterthan240kbtuh","Greaterthan240kbtuh","Greaterthan240kbtuh","Greaterthan240kbtuh","Greaterthan240kbtuh","Greaterthan240kbtuh","Greaterthan240kbtuh",17,"DX",15,14,13,12,11,10,9.1,8.1999999999999993,7.3,6.5,5.7,5,4.4000000000000004,3.8,3.3,2.8,2,1,0,0,0,0,0,0,0,0,0,0,0,0,0,0,0,0,0,0,0,0,0,0,0]
[null,null,null,2012,null,"Single Package Vertical Heat Pump",null,"VRFHeatPump",null,"PackagedTerminalAirConditionerStandardSize",24,null,null,null,null,null,null,null,null,null,null,null,null,null,null,null,null,null,17,"PTRoom",15,14,13,12,11,10,9.1,8.1999999999999993,7.3,6.5,5.7,5,4.4000000000000004,3.8,3.3,2.8,2,1,0,0,0,0,0,0,0,0,0,0,0,0,0,0,0,0,0,0,0,0,0,0,0]
[null,null,null,2013,null,null,null,"without Heat Recovery",null,"PackagedTerminalAirConditionerNonStandardSize",25,null,null,null,null,null,null,null,null,null,null,null,null,null,null,null,null,null,17,"PTRoom",15,14,13,12,11,10,9.1,8.1999999999999993,7.3,6.5,5.7,5,4.4000000000000004,3.8,3.3,2.8,2,1,0,0,0,0,0,0,0,0,0,0,0,0,0,0,0,0,0,0,0,0,0,0,0]
[null,null,null,2014,null,"OKEquipmentType",null,"with Heat Recovery",null,"PackagedTerminalHeatPumpStandardSize",26,null,null,null,null,null,null,null,null,null,null,null,null,null,null,null,null,null,17,"PTRoom",15,14,13,12,11,10,9.1,8.1999999999999993,7.3,6.5,5.7,5,4.4000000000000004,3.8,3.3,2.8,2,1,0,0,0,0,0,0,0,0,0,0,0,0,0,0,0,0,0,0,0,0,0,0,0]
[null,null,null,2015,null,"Air Cooled Chiller",null,null,null,"PackagedTerminalHeatPumpNonStandardSize",27,null,null,null,null,null,null,null,null,null,null,null,null,null,null,null,null,null,17,"PTRoom",15,14,13,12,11,10,9.1,8.1999999999999993,7.3,6.5,5.7,5,4.4000000000000004,3.8,3.3,2.8,2,1,0,0,0,0,0,0,0,0,0,0,0,0,0,0,0,0,0,0,0,0,0,0,0]
[null,null,null,2016,null,"Water Cooled Chiller",null,"GeothermalAirConditioner",null,"GeothermalAirConditionerWaterCooled",28,"Lessthan65kbtuh","Lessthan65kbtuh","Lessthan65kbtuh","Lessthan65kbtuh","Lessthan65kbtuh","Lessthan65kbtuh","Lessthan65kbtuh","Lessthan65kbtuh","65to135kbtuh","135to240kbtuh","240to760kbtuh","Greaterthan760kbtuh","Greaterthan760kbtuh","Greaterthan760kbtuh","Greaterthan760kbtuh","Greaterthan760kbtuh","Greaterthan760kbtuh",17,"DX",15,0,0,0,0,0,0,0,0,0,0,0,0,0,0,0,0,0,0,0,0,0,0,0,0,0,0,0,0,0,0,0,0,0,0,0,0,0,0,0,0]
[null,null,null,2017,null,"Unitary Air Conditioner",null,"Water Cooled",null,"GeothermalAirConditionerEvaporativelyCooled",29,"Lessthan65kbtuh","Lessthan65kbtuh","Lessthan65kbtuh","Lessthan65kbtuh","Lessthan65kbtuh","Lessthan65kbtuh","Lessthan65kbtuh","Lessthan65kbtuh","65to135kbtuh","135to240kbtuh","240to760kbtuh","Greaterthan760kbtuh","Greaterthan760kbtuh","Greaterthan760kbtuh","Greaterthan760kbtuh","Greaterthan760kbtuh","Greaterthan760kbtuh",17,"DX",15,0,0,0,0,0,0,0,0,0,0,0,0,0,0,0,0,0,0,0,0,0,0,0,0,0,0,0,0,0,0,0,0,0,0,0,0,0,0,0,0]
[null,null,null,2018,null,"Unitary Heat Pump",null,"Evaporatively Cooled",null,"GeothermalHeatPumpWatertoAirWaterLoop",30,"Lessthan17kbtuh","Lessthan17kbtuh","Lessthan17kbtuh","Lessthan17kbtuh","Lessthan17kbtuh","17to65kbtuh","17to65kbtuh","17to65kbtuh","65to135kbtuh",null,null,null,null,null,null,null,null,17,"DX",15,0,0,0,0,0,0,0,0,0,0,0,0,0,0,0,0,0,0,0,0,0,0,0,0,0,0,0,0,0,0,0,0,0,0,0,0,0,0,0,0]
[null,null,null,null,null,"Packaged Terminal Air Conditioner",null,null,null,"GeothermalHeatPumpWatertoAirGroundWater",31,"Lessthan65kbtuh","Lessthan65kbtuh","Lessthan65kbtuh","Lessthan65kbtuh","Lessthan65kbtuh","Lessthan65kbtuh","Lessthan65kbtuh","Lessthan65kbtuh","65to135kbtuh",null,null,null,null,null,null,null,null,17,"DX",15,0,0,0,0,0,0,0,0,0,0,0,0,0,0,0,0,0,0,0,0,0,0,0,0,0,0,0,0,0,0,0,0,0,0,0,0,0,0,0,0]
[null,null,null,null,null,"Packaged Terminal Heat Pump",null,"GeothermalHeatPump",null,"GeothermalHeatPumpBrinetoAirGroundLoop",32,"Lessthan65kbtuh","Lessthan65kbtuh","Lessthan65kbtuh","Lessthan65kbtuh","Lessthan65kbtuh","Lessthan65kbtuh","Lessthan65kbtuh","Lessthan65kbtuh","65to135kbtuh",null,null,null,null,null,null,null,null,17,"DX",15,0,0,0,0,0,0,0,0,0,0,0,0,0,0,0,0,0,0,0,0,0,0,0,0,0,0,0,0,0,0,0,0,0,0,0,0,0,0,0,0]
[null,null,null,null,null,"Geothermal Air Conditioner",null,"Water to Air / Water Loop",null,"GeothermalHeatPumpWatertoWaterWaterLoop",33,"Lessthan65kbtuh","Lessthan65kbtuh","Lessthan65kbtuh","Lessthan65kbtuh","Lessthan65kbtuh","Lessthan65kbtuh","Lessthan65kbtuh","Lessthan65kbtuh","65to135kbtuh",null,null,null,null,null,null,null,null,17,"DX",15,0,0,0,0,0,0,0,0,0,0,0,0,0,0,0,0,0,0,0,0,0,0,0,0,0,0,0,0,0,0,0,0,0,0,0,0,0,0,0,0]
[null,null,null,null,null,"Geothermal Heat Pump",null,"Water to Air / Ground Water",null,"GeothermalHeatPumpWatertoWaterGroundWater",34,"Lessthan65kbtuh","Lessthan65kbtuh","Lessthan65kbtuh","Lessthan65kbtuh","Lessthan65kbtuh","Lessthan65kbtuh","Lessthan65kbtuh","Lessthan65kbtuh","65to135kbtuh",null,null,null,null,null,null,null,null,17,"DX",15,0,0,0,0,0,0,0,0,0,0,0,0,0,0,0,0,0,0,0,0,0,0,0,0,0,0,0,0,0,0,0,0,0,0,0,0,0,0,0,0]
[null,null,null,null,null,null,null,"Brine to Air / Ground Loop",null,"GeothermalHeatPumpBrinetoWaterGroundLoop",35,"Lessthan65kbtuh","Lessthan65kbtuh","Lessthan65kbtuh","Lessthan65kbtuh","Lessthan65kbtuh","Lessthan65kbtuh","Lessthan65kbtuh","Lessthan65kbtuh","65to135kbtuh",null,null,null,null,null,null,null,null,17,"DX",15,0,0,0,0,0,0,0,0,0,0,0,0,0,0,0,0,0,0,0,0,0,0,0,0,0,0,0,0,0,0,0,0,0,0,0,0,0,0,0,0]
[null,null,null,null,null,null,null,"Water to Water / Water Loop",null,"ComputerRoomACAirCooledDownflow",36,"Lessthan65kbtuh","Lessthan65kbtuh","Lessthan65kbtuh","Lessthan65kbtuh","Lessthan65kbtuh","Lessthan65kbtuh","Lessthan65kbtuh","Lessthan65kbtuh","65to240kbtuh","65to240kbtuh","Greaterthan240kbtuh",null,null,null,null,null,null,17,"DX",15,0,0,0,0,0,0,0,0,0,0,0,0,0,0,0,0,0,0,0,0,0,0,0,0,0,0,0,0,0,0,0,0,0,0,0,0,0,0,0,0]
[null,null,null,null,null,null,null,"Water to Water / Ground Water",null,"ComputerRoomACAirCooledUpflow",37,"Lessthan65kbtuh","Lessthan65kbtuh","Lessthan65kbtuh","Lessthan65kbtuh","Lessthan65kbtuh","Lessthan65kbtuh","Lessthan65kbtuh","Lessthan65kbtuh","65to240kbtuh","65to240kbtuh","Greaterthan240kbtuh",null,null,null,null,null,null,17,"DX",15,0,0,0,0,0,0,0,0,0,0,0,0,0,0,0,0,0,0,0,0,0,0,0,0,0,0,0,0,0,0,0,0,0,0,0,0,0,0,0,0]
[null,null,null,null,null,null,null,"Brine to Water / Ground Loop",null,"ComputerRoomACWaterCooledDownflow",38,"Lessthan65kbtuh","Lessthan65kbtuh","Lessthan65kbtuh","Lessthan65kbtuh","Lessthan65kbtuh","Lessthan65kbtuh","Lessthan65kbtuh","Lessthan65kbtuh","65to240kbtuh","65to240kbtuh","Greaterthan240kbtuh",null,null,null,null,null,null,17,"DX",15,0,0,0,0,0,0,0,0,0,0,0,0,0,0,0,0,0,0,0,0,0,0,0,0,0,0,0,0,0,0,0,0,0,0,0,0,0,0,0,0]
[null,null,null,null,null,null,null,null,null,"ComputerRoomACWaterCooledUpflow",39,"Lessthan65kbtuh","Lessthan65kbtuh","Lessthan65kbtuh","Lessthan65kbtuh","Lessthan65kbtuh","Lessthan65kbtuh","Lessthan65kbtuh","Lessthan65kbtuh","65to240kbtuh","65to240kbtuh","Greaterthan240kbtuh",null,null,null,null,null,null,17,"DX",15,0,0,0,0,0,0,0,0,0,0,0,0,0,0,0,0,0,0,0,0,0,0,0,0,0,0,0,0,0,0,0,0,0,0,0,0,0,0,0,0]
[null,null,null,null,null,null,null,"GeothermalAirConditionerHeatingType",null,"ComputerRoomACWaterCooledwithFluidEconomizerDownflow",40,"Lessthan65kbtuh","Lessthan65kbtuh","Lessthan65kbtuh","Lessthan65kbtuh","Lessthan65kbtuh","Lessthan65kbtuh","Lessthan65kbtuh","Lessthan65kbtuh","65to240kbtuh","65to240kbtuh","Greaterthan240kbtuh",null,null,null,null,null,null,17,"DX",15,0,0,0,0,0,0,0,0,0,0,0,0,0,0,0,0,0,0,0,0,0,0,0,0,0,0,0,0,0,0,0,0,0,0,0,0,0,0,0,0]
[null,"Default Units Table",null,"Capacity",null,null,null,"Elec Res or None",null,"ComputerRoomACWaterCooledwithFluidEconomizerUpflow",41,"Lessthan65kbtuh","Lessthan65kbtuh","Lessthan65kbtuh","Lessthan65kbtuh","Lessthan65kbtuh","Lessthan65kbtuh","Lessthan65kbtuh","Lessthan65kbtuh","65to240kbtuh","65to240kbtuh","Greaterthan240kbtuh",null,null,null,null,null,null,17,"DX",15,0,0,0,0,0,0,0,0,0,0,0,0,0,0,0,0,0,0,0,0,0,0,0,0,0,0,0,0,0,0,0,0,0,0,0,0,0,0,0,0]
[null,"Equipment Type",null,"tons",null,"Efficiency ",null,"Other",null,"ComputerRoomACGlycolCooledDownflow",42,"Lessthan65kbtuh","Lessthan65kbtuh","Lessthan65kbtuh","Lessthan65kbtuh","Lessthan65kbtuh","Lessthan65kbtuh","Lessthan65kbtuh","Lessthan65kbtuh","65to240kbtuh","65to240kbtuh","Greaterthan240kbtuh",null,null,null,null,null,null,17,"DX",15,0,0,0,0,0,0,0,0,0,0,0,0,0,0,0,0,0,0,0,0,0,0,0,0,0,0,0,0,0,0,0,0,0,0,0,0,0,0,0,0]
[null,"Air Cooled Chiller",null,"tons",null,"EER",null,null,null,"ComputerRoomACGlycolCooledUpflow",43,"Lessthan65kbtuh","Lessthan65kbtuh","Lessthan65kbtuh","Lessthan65kbtuh","Lessthan65kbtuh","Lessthan65kbtuh","Lessthan65kbtuh","Lessthan65kbtuh","65to240kbtuh","65to240kbtuh","Greaterthan240kbtuh",null,null,null,null,null,null,17,"DX",15,0,0,0,0,0,0,0,0,0,0,0,0,0,0,0,0,0,0,0,0,0,0,0,0,0,0,0,0,0,0,0,0,0,0,0,0,0,0,0,0]
[null,"Water Cooled Chiller",null,"Btuh",null,"kW/ton",null,"UnitaryAirConditioner"]
[null,"Unitary Air Conditioner",null,"Btuh",null,"EER",null,"Split"]
[null,"Unitary Heat Pump",null,"Btuh",null,"EER",null,"Packaged"]
[null,"Packaged Terminal Air Conditioner",null,"Btuh",null,"EER"]
[null,"Packaged Terminal Heat Pump",null,"Btuh",null,"EER",null,"UnitaryHeatPump"]
[null,"Room Air Conditioner",null,"Btuh",null,"EER",null,"Split"]
[null,"VRF Air Conditioner",null,"Btuh",null,"EER",null,"Packaged"]
[null,"VRF Heat Pump",null,"Btuh",null,"EER"]
[null,"Single Package Vertical Air Conditioner",null,"Btuh",null,"EER",null,"UnitaryAirConditionerHeatingType"]
[null,"Single Package Vertical Heat Pump",null,"Btuh",null,"EER",null,"Elec Res or None"]
[null,"Geothermal Air Conditioner",null,"Btuh",null,"EER",null,"Other"]
[null,"Geothermal Heat Pump",null,"Btuh",null,"EER"]
[null,"Computer Room AC",null,null,null,"SCOP",null,"UnitaryHeatPumpHeatingType"]
[null,null,null,null,null,null,null,"Elec Res or None"]
[null,null,null,null,null,null,null,"Other"]
[]
[null,null,null,null,null,null,null,"ComputerRoomAC"]
[null,null,null,null,null,null,null,"Air Cooled / Downflow"]
[null,null,null,null,null,null,null,"Air Cooled / Upflow"]
[null,null,null,null,null,null,null,"Water Cooled / Downflow"]
[null,null,null,null,null,null,null,"Water Cooled / Upflow"]
[null,null,null,null,null,null,null,"Water Cooled with Fluid Economizer / Downflow"]
[null,null,null,null,null,null,null,"Water Cooled with Fluid Economizer / Upflow"]
[null,null,null,null,null,null,null,"Glycol Cooled / Downflow"]
[null,null,null,null,null,null,null,"Glycol Cooled / Upflow"]

{"sheet":"County to Zone","index":16,"n_rows":257,"n_cols":8,"rows_kept":257,"cut":false,"hidden":true,"merged":[]}
["AR",null,null,"OK",null,null,"TX"]
["County","Zone",null,"County","Zone",null,"County","Zone"]
["Arkansas",6,null,"Adair",8,null,"Anderson",2]
["Ashley",6,null,"Alfalfa",9,null,"Andrews",2]
["Baxter",9,null,"Atoka",7,null,"Angelina",2]
["Benton",9,null,"Beaver",9,null,"Aransas",4]
["Boone",9,null,"Beckham",8,null,"Archer",2]
["Bradley",6,null,"Blaine",8,null,"Armstrong",1]
["Calhoun",6,null,"Bryan",7,null,"Atascosa",3]
["Carroll",9,null,"Caddo",8,null,"Austin",3]
["Chicot",6,null,"Canadian",8,null,"Bailey",1]
["Clark",6,null,"Carter",6,null,"Bandera",2]
["Clay",8,null,"Cherokee",8,null,"Bastrop",3]
["Cleburne",8,null,"Choctaw",6,null,"Baylor",2]
["Cleveland",6,null,"Cimarron",9,null,"Bee",3]
["Columbia",6,null,"Cleveland",7,null,"Bell",2]
["Conway",7,null,"Coal",7,null,"Bexar",3]
["Craighead",8,null,"Comanche",7,null,"Blanco",2]
["Crawford",8,null,"Cotton",7,null,"Borden",2]
["Crittenden",7,null,"Craig",9,null,"Bosque",2]
["Cross",7,null,"Creek",8,null,"Bowie",2]
["Dallas",6,null,"Cluster",8,null,"Brazoria",3]
["Desha",6,null,"Deleware",8,null,"Brazos",3]
["Drew",6,null,"Dewey",9,null,"Brewster",2]
["Faulkner",7,null,"Ellis",9,null,"Briscoe",1]
["Franklin",8,null,"Garfield",8,null,"Brooks",4]
["Fulton",8,null,"Garvin",7,null,"Brown",2]
["Garland",7,null,"Grady",7,null,"Burleson",3]
["Grant",6,null,"Grant",9,null,"Burnet",2]
["Greene",8,null,"Greer",7,null,"Caldwell",3]
["Hempstead",7,null,"Harmon",7,null,"Calhoun",4]
["Hot Spring",7,null,"Harper",9,null,"Callahan",2]
["Howard",7,null,"Haskell",7,null,"Cameron",4]
["Independence",8,null,"Hughes",7,null,"Camp",2]
["Izard",8,null,"Jackson",7,null,"Carson",1]
["Jackson",8,null,"Jefferson",6,null,"Cass",2]
["Jefferson",6,null,"Johnston",6,null,"Castro",1]
["Johnson",8,null,"Kay",9,null,"Chambers",3]
["Lafayette",6,null,"Kingfisher",8,null,"Cherokee",2]
["Lawrence",8,null,"Kiowa",7,null,"Childress",1]
["Lee",7,null,"Latimer",7,null,"Clay",2]
["Lincoln",6,null,"Le Flore",7,null,"Cochran",1]
["Little River",6,null,"Lincoln",7,null,"Coke",2]
["Logan",7,null,"Logan",8,null,"Coleman",2]
["Lonoke",7,null,"Love",6,null,"Collin",2]
["Madison",9,null,"Major",9,null,"Collingsworth",1]
["Marion",9,null,"Marshall",6,null,"Colorado",3]
["Miller",6,null,"Mayes",8,null,"Comal",3]
["Mississippi",8,null,"McClain",7,null,"Comanche",2]
["Monroe",7,null,"McCurtain",7,null,"Concho",2]
["Montgomery",8,null,"McIntosh",7,null,"Cooke",2]
["Nevada",6,null,"Murray",7,null,"Coryell",2]
["Newton",9,null,"Muskogee",7,null,"Cottle",1]
["Ouachita",6,null,"Noble",8,null,"Crane",2]
["Perry",7,null,"Nowata",9,null,"Crockett",2]
["Phillips",7,null,"Okfuskee",7,null,"Crosby",1]
["Pike",7,null,"Oklahoma",8,null,"Culberson",2]
["Poinsett",8,null,"Okmulgee",8,null,"Dallam",1]
["Polk",8,null,"Osage",8,null,"Dallas",2]
["Pope",8,null,"Ottawa",9,null,"Dawson",2]
["Prairie",7,null,"Pawnee",8,null,"De Witt",3]
["Pulaski",7,null,"Payne",8,null,"Deaf Smith",1]
["Randolph",8,null,"Pittsburg",7,null,"Delta",2]
["Saline",7,null,"Pontotoc",7,null,"Denton",2]
["Scott",7,null,"Pottawatomie",7,null,"Dickens",1]
["Searcy",9,null,"Pushmataha",6,null,"Dimmit",3]
["Sebastian",8,null,"Roger Mills",9,null,"Donley",1]
["Sevier",7,null,"Rogers",9,null,"Duval",4]
["Sharp",8,null,"Seminole",7,null,"Eastland",2]
["St. Francis",7,null,"Sequoyah",7,null,"Ector",2]
["Stone",9,null,"Stephens",7,null,"Edwards",2]
["Union",6,null,"Texas",9,null,"El Paso",5]
["Van Buren",8,null,"Tillman",7,null,"Ellis",2]
["Washington",9,null,"Tulsa",8,null,"Erath",2]
["White",7,null,"Wagoner",8,null,"Falls",2]
["Woodruff",7,null,"Washington",9,null,"Fannin",2]
["Yell",7,null,"Washita",8,null,"Fayette",3]
[null,null,null,"Woods",9,null,"Fisher",2]
[null,null,null,"Woodward",9,null,"Floyd",1]
[null,null,null,null,null,null,"Foard",1]
[null,null,null,null,null,null,"Fort Bend",3]
[null,null,null,null,null,null,"Franklin",2]
[null,null,null,null,null,null,"Freestone",2]
[null,null,null,null,null,null,"Frio",3]
[null,null,null,null,null,null,"Gaines",1]
[null,null,null,null,null,null,"Galveston",3]
[null,null,null,null,null,null,"Garza",1]
[null,null,null,null,null,null,"Gillespie",2]
[null,null,null,null,null,null,"Glasscock",2]
[null,null,null,null,null,null,"Goliad",3]
[null,null,null,null,null,null,"Gonzales",3]
[null,null,null,null,null,null,"Gray",1]
[null,null,null,null,null,null,"Grayson",2]
[null,null,null,null,null,null,"Gregg",2]
[null,null,null,null,null,null,"Grimes",3]
[null,null,null,null,null,null,"Guadalupe",3]
[null,null,null,null,null,null,"Hale",1]
[null,null,null,null,null,null,"Hall",1]
[null,null,null,null,null,null,"Hamilton",2]
[null,null,null,null,null,null,"Hansford",1]
[null,null,null,null,null,null,"Hardeman",1]
[null,null,null,null,null,null,"Hardin",3]
[null,null,null,null,null,null,"Harris",3]
[null,null,null,null,null,null,"Harrison",2]
[null,null,null,null,null,null,"Hartley",1]
[null,null,null,null,null,null,"Haskell",2]
[null,null,null,null,null,null,"Hays",2]
[null,null,null,null,null,null,"Hemphill",1]
[null,null,null,null,null,null,"Henderson",2]
[null,null,null,null,null,null,"Hidalgo",4]
[null,null,null,null,null,null,"Hill",2]
[null,null,null,null,null,null,"Hockley",1]
[null,null,null,null,null,null,"Hood",2]
[null,null,null,null,null,null,"Hopkins",2]
[null,null,null,null,null,null,"Houston",3]
[null,null,null,null,null,null,"Howard",2]
[null,null,null,null,null,null,"Hudspeth",5]
[null,null,null,null,null,null,"Hunt",2]
[null,null,null,null,null,null,"Hutchinson",1]
[null,null,null,null,null,null,"Irion",2]
[null,null,null,null,null,null,"Jack",2]
[null,null,null,null,null,null,"Jackson",3]
[null,null,null,null,null,null,"Jasper",2]
[null,null,null,null,null,null,"Jeff Davis",2]
[null,null,null,null,null,null,"Jefferson",3]
[null,null,null,null,null,null,"Jim Hogg",4]
[null,null,null,null,null,null,"Jim Wells",4]
[null,null,null,null,null,null,"Johnson",2]
[null,null,null,null,null,null,"Jones",2]
[null,null,null,null,null,null,"Karnes",3]
[null,null,null,null,null,null,"Kaufman",2]
[null,null,null,null,null,null,"Kendall",2]
[null,null,null,null,null,null,"Kenedy",4]
[null,null,null,null,null,null,"Kent",1]
[null,null,null,null,null,null,"Kerr",2]
[null,null,null,null,null,null,"Kimble",2]
[null,null,null,null,null,null,"King",1]
[null,null,null,null,null,null,"Kinney",3]
[null,null,null,null,null,null,"Kleberg",4]
[null,null,null,null,null,null,"Knox",1]
[null,null,null,null,null,null,"La Salle",3]
[null,null,null,null,null,null,"Lamar",2]
[null,null,null,null,null,null,"Lamb",1]
[null,null,null,null,null,null,"Lampasas",2]
[null,null,null,null,null,null,"Lavaca",3]
[null,null,null,null,null,null,"Lee",3]
[null,null,null,null,null,null,"Leon",2]
[null,null,null,null,null,null,"Liberty",3]
[null,null,null,null,null,null,"Limestone",2]
[null,null,null,null,null,null,"Lipscomb",1]
[null,null,null,null,null,null,"Live Oak",3]
[null,null,null,null,null,null,"Llano",2]
[null,null,null,null,null,null,"Loving",2]
[null,null,null,null,null,null,"Lubbock",1]
[null,null,null,null,null,null,"Lynn",1]
[null,null,null,null,null,null,"Madison",2]
[null,null,null,null,null,null,"Marion",2]
[null,null,null,null,null,null,"Martin",2]
[null,null,null,null,null,null,"Mason",2]
[null,null,null,null,null,null,"Matagorda",3]
[null,null,null,null,null,null,"Maverick",3]
[null,null,null,null,null,null,"McCulloch",2]
[null,null,null,null,null,null,"McLennan",2]
[null,null,null,null,null,null,"McMullen",3]
[null,null,null,null,null,null,"Medina",3]
[null,null,null,null,null,null,"Menard",2]
[null,null,null,null,null,null,"Midland",2]
[null,null,null,null,null,null,"Milam",3]
[null,null,null,null,null,null,"Mills",2]
[null,null,null,null,null,null,"Mitchell",2]
[null,null,null,null,null,null,"Montague",2]
[null,null,null,null,null,null,"Montgomery",3]
[null,null,null,null,null,null,"Moore",1]
[null,null,null,null,null,null,"Morris",2]
[null,null,null,null,null,null,"Motley",1]
[null,null,null,null,null,null,"N/A"]
[null,null,null,null,null,null,"Nacogdoches",2]
[null,null,null,null,null,null,"Navarro",2]
[null,null,null,null,null,null,"Newton",2]
[null,null,null,null,null,null,"Nolan",2]
[null,null,null,null,null,null,"Nueces",4]
[null,null,null,null,null,null,"Ochiltree",1]
[null,null,null,null,null,null,"Oldham",1]
[null,null,null,null,null,null,"Orange",3]
[null,null,null,null,null,null,"Palo Pinto",2]
[null,null,null,null,null,null,"Panola",2]
[null,null,null,null,null,null,"Parker",2]
[null,null,null,null,null,null,"Parmer",1]
[null,null,null,null,null,null,"Pecos",2]
[null,null,null,null,null,null,"Polk",3]
[null,null,null,null,null,null,"Potter",1]
[null,null,null,null,null,null,"Presidio",2]
[null,null,null,null,null,null,"Rains",2]
[null,null,null,null,null,null,"Randall",1]
[null,null,null,null,null,null,"Reagan",2]
[null,null,null,null,null,null,"Real",2]
[null,null,null,null,null,null,"Red River",2]
[null,null,null,null,null,null,"Reeves",2]
[null,null,null,null,null,null,"Refugio",4]
[null,null,null,null,null,null,"Roberts",1]
[null,null,null,null,null,null,"Robertson",2]
[null,null,null,null,null,null,"Rockwall",2]
[null,null,null,null,null,null,"Runnels",2]
[null,null,null,null,null,null,"Rusk",2]
[null,null,null,null,null,null,"Sabine",2]
[null,null,null,null,null,null,"San Augustine",2]
[null,null,null,null,null,null,"San Jacinto",3]
[null,null,null,null,null,null,"San Patricio",4]
[null,null,null,null,null,null,"San Saba",2]
[null,null,null,null,null,null,"Schleicher",2]
[null,null,null,null,null,null,"Scurry",2]
[null,null,null,null,null,null,"Shackelford",2]
[null,null,null,null,null,null,"Shelby",2]
[null,null,null,null,null,null,"Sherman",1]
[null,null,null,null,null,null,"Smith",2]
[null,null,null,null,null,null,"Somervell",2]
[null,null,null,null,null,null,"Starr",4]
[null,null,null,null,null,null,"Stephens",2]
[null,null,null,null,null,null,"Sterling",2]
[null,null,null,null,null,null,"Stonewall",1]
[null,null,null,null,null,null,"Sutton",2]
[null,null,null,null,null,null,"Swisher",1]
[null,null,null,null,null,null,"Tarrant",2]
[null,null,null,null,null,null,"Taylor",2]
[null,null,null,null,null,null,"Terrell",2]
[null,null,null,null,null,null,"Terry",1]
[null,null,null,null,null,null,"Throckmorton",2]
[null,null,null,null,null,null,"Titus",2]
[null,null,null,null,null,null,"Tom Green",2]
[null,null,null,null,null,null,"Travis",2]
[null,null,null,null,null,null,"Trinity",3]
[null,null,null,null,null,null,"Tyler",3]
[null,null,null,null,null,null,"Upshur",2]
[null,null,null,null,null,null,"Upton",2]
[null,null,null,null,null,null,"Uvalde",3]
[null,null,null,null,null,null,"Val Verde",3]
[null,null,null,null,null,null,"Van Zandt",2]
[null,null,null,null,null,null,"Victoria",3]
[null,null,null,null,null,null,"Walker",3]
[null,null,null,null,null,null,"Waller",3]
[null,null,null,null,null,null,"Ward",2]
[null,null,null,null,null,null,"Washington",3]
[null,null,null,null,null,null,"Webb",4]
[null,null,null,null,null,null,"Wharton",3]
[null,null,null,null,null,null,"Wheeler",1]
[null,null,null,null,null,null,"Wichita",2]
[null,null,null,null,null,null,"Wilbarger",1]
[null,null,null,null,null,null,"Willacy",4]
[null,null,null,null,null,null,"Williamson",2]
[null,null,null,null,null,null,"Wilson",3]
[null,null,null,null,null,null,"Winkler",2]
[null,null,null,null,null,null,"Wise",2]
[null,null,null,null,null,null,"Wood",2]
[null,null,null,null,null,null,"Yoakum",1]
[null,null,null,null,null,null,"Young",2]
[null,null,null,null,null,null,"Zapata",4]
[null,null,null,null,null,null,"Zavala",3]

{"sheet":"EFLH","index":17,"n_rows":60,"n_cols":37,"rows_kept":60,"cut":false,"hidden":true,"merged":[]}
[null,"Zone",{"$f":"VLOOKUP('Project Info'!D8,INDIRECT(D1),2,FALSE)","v":{"$error":"#REF!"}},{"$f":"'Project Info'!D7&\"ZONE\"","v":"ZONE"}]
[null,"OK EFLH Table - Zone 6",null,null,null,null,"AR EFLH Table - Zone 6",null,null,null,null,null,"TX EFLH Table - San Antonio","Air Cooled Chiller","Water Cooled Chiller","DX","PTRoom","Air Cooled Chiller","Water Cooled Chiller","DX","PTRoom","Air Cooled Chiller","Water Cooled Chiller","DX","PTRoom","DX","PTRoom"]
[null,"Building Type","Cooling EFLH","Heating EFLH","CF",null,"Building Type","Cooling EFLH","Heating EFLH","CF",null,null,"Building Type","CFAir Cooled Chiller","CFWater Cooled Chiller","CFDX","CFPTRoom","NCPAir Cooled Chiller","NCPWater Cooled Chiller","NCPDX","NCPPTRoom","EFLHcAir Cooled Chiller","EFLHcWater Cooled Chiller","EFLHcDX","EFLHcPTRoom","EFLHhDX","EFLHhPTRoom"]
[null,"Assembly",2017,615,0.82,null,"Assembly",2017,615,0.82,null,null,"Data Center",0,0,1.05,0,0,0,1.07,0,0,0,4022,0,107,0,{"$f":"\"TXEq\"&SUBSTITUTE(SUBSTITUTE(SUBSTITUTE(SUBSTITUTE(TX_EFLHSanAntonio[[#This Row],[Building Type]],\" \",\"\"),\"(\",\"\"),\")\",\"\"),\"/\",\"\")","v":"TXEqDataCenter"},null,null,"Unitary Air Conditioner","Unitary Heat Pump","Computer Room AC","Geothermal Air Conditioner","Geothermal Heat Pump"]
[null,"College/University",1698,674,0.84,null,"College/University",1698,674,0.84,null,null,"College",0.84,0.52,1.08,0,0.89,0.72,1.1200000000000001,0,2173,3894,2101,0,251,0,{"$f":"\"TXEq\"&SUBSTITUTE(SUBSTITUTE(SUBSTITUTE(SUBSTITUTE(TX_EFLHSanAntonio[[#This Row],[Building Type]],\" \",\"\"),\"(\",\"\"),\")\",\"\"),\"/\",\"\")","v":"TXEqCollege"},"Air Cooled Chiller","Water Cooled Chiller","Unitary Air Conditioner","Unitary Heat Pump","Geothermal Air Conditioner","Geothermal Heat Pump",""]
[null,"Fast Food Restaurant",1393,287,0.78,null,"Fast Food Restaurant",1393,287,0.78,null,null,"Primary School",0.55000000000000004,0.57999999999999996,1.06,0.85,0.6,0.63,1.1000000000000001,0.88,915,1716,1633,1330,251,86,{"$f":"\"TXEq\"&SUBSTITUTE(SUBSTITUTE(SUBSTITUTE(SUBSTITUTE(TX_EFLHSanAntonio[[#This Row],[Building Type]],\" \",\"\"),\"(\",\"\"),\")\",\"\"),\"/\",\"\")","v":"TXEqPrimarySchool"},"Air Cooled Chiller","Water Cooled Chiller","Unitary Air Conditioner","Unitary Heat Pump","Packaged Terminal Air Conditioner","Packaged Terminal Heat Pump","Room Air Conditioner","Geothermal Air Conditioner","Geothermal Heat Pump"]
[null,"Full Menu Restaurant",1819,178,0.85,null,"Full Menu Restaurant",1819,178,0.85,null,null,"Secondary School",0.84,0.52,1.08,0.86,0.89,0.72,1.1200000000000001,0.9,1477,2647,1429,1163,281,96,{"$f":"\"TXEq\"&SUBSTITUTE(SUBSTITUTE(SUBSTITUTE(SUBSTITUTE(TX_EFLHSanAntonio[[#This Row],[Building Type]],\" \",\"\"),\"(\",\"\"),\")\",\"\"),\"/\",\"\")","v":"TXEqSecondarySchool"},"Air Cooled Chiller","Water Cooled Chiller","Unitary Air Conditioner","Unitary Heat Pump","Packaged Terminal Air Conditioner","Packaged Terminal Heat Pump","Room Air Conditioner","Geothermal Air Conditioner","Geothermal Heat Pump"]
[null,"Grocery Store",1594,692,0.9,null,"Grocery Store",1594,692,0.9,null,null,"Convenience",0,0,1.03,0.82,0,0,1.1299999999999999,0.9,0,0,2307,1878,230,120,{"$f":"\"TXEq\"&SUBSTITUTE(SUBSTITUTE(SUBSTITUTE(SUBSTITUTE(TX_EFLHSanAntonio[[#This Row],[Building Type]],\" \",\"\"),\"(\",\"\"),\")\",\"\"),\"/\",\"\")","v":"TXEqConvenience"},"","","Unitary Air Conditioner","Unitary Heat Pump","Packaged Terminal Air Conditioner","Packaged Terminal Heat Pump","Room Air Conditioner","Geothermal Air Conditioner","Geothermal Heat Pump"]
[null,"Health Clinic",1627,641,0.85,null,"Health Clinic",1627,641,0.85,null,null,"Supermarket",0,0,0.61,0,0,0,0.65,0,0,0,829,0,230,0,{"$f":"\"TXEq\"&SUBSTITUTE(SUBSTITUTE(SUBSTITUTE(SUBSTITUTE(TX_EFLHSanAntonio[[#This Row],[Building Type]],\" \",\"\"),\"(\",\"\"),\")\",\"\"),\"/\",\"\")","v":"TXEqSupermarket"},"","","Unitary Air Conditioner","Unitary Heat Pump","Geothermal Air Conditioner","Geothermal Heat Pump",""]
[null,"Lodging",1434,391,0.77,null,"Lodging",1434,391,0.77,null,null,"Full Service Restaurant",0,0,1.06,0.85,0,0,1.1299999999999999,0.9,0,0,2249,1831,542,185,{"$f":"\"TXEq\"&SUBSTITUTE(SUBSTITUTE(SUBSTITUTE(SUBSTITUTE(TX_EFLHSanAntonio[[#This Row],[Building Type]],\" \",\"\"),\"(\",\"\"),\")\",\"\"),\"/\",\"\")","v":"TXEqFullServiceRestaurant"},"","","Unitary Air Conditioner","Unitary Heat Pump","Packaged Terminal Air Conditioner","Packaged Terminal Heat Pump","Room Air Conditioner","Geothermal Air Conditioner","Geothermal Heat Pump"]
[null,"Large Office (>30k SqFt)",2387,816,0.84,null,"Large Office (>30k SqFt)",2387,816,0.84,null,null,"24 Hr Full Service",0,0,1.07,0.86,0,0,1.1399999999999999,0.91,0,0,2548,2075,680,232,{"$f":"\"TXEq\"&SUBSTITUTE(SUBSTITUTE(SUBSTITUTE(SUBSTITUTE(TX_EFLHSanAntonio[[#This Row],[Building Type]],\" \",\"\"),\"(\",\"\"),\")\",\"\"),\"/\",\"\")","v":"TXEq24HrFullService"},"","","Unitary Air Conditioner","Unitary Heat Pump","Packaged Terminal Air Conditioner","Packaged Terminal Heat Pump","Room Air Conditioner","Geothermal Air Conditioner","Geothermal Heat Pump"]
[null,"Small Office (<=30k SqFt)",1696,351,0.84,null,"Small Office (<=30k SqFt)",1696,351,0.84,null,null,"Quick Service Restaurant",0,0,1.03,0.82,0,0,1.1299999999999999,0.9,0,0,1996,1625,405,138,{"$f":"\"TXEq\"&SUBSTITUTE(SUBSTITUTE(SUBSTITUTE(SUBSTITUTE(TX_EFLHSanAntonio[[#This Row],[Building Type]],\" \",\"\"),\"(\",\"\"),\")\",\"\"),\"/\",\"\")","v":"TXEqQuickServiceRestaurant"},"","","Unitary Air Conditioner","Unitary Heat Pump","Packaged Terminal Air Conditioner","Packaged Terminal Heat Pump","Room Air Conditioner","Geothermal Air Conditioner","Geothermal Heat Pump"]
[null,"Religious Worship",1799,575,0.82,null,"Religious Worship",1799,575,0.82,null,null,"24 Hr Quick Service",0,0,1.06,0.85,0,0,1.1299999999999999,0.9,0,0,2311,1882,599,205,{"$f":"\"TXEq\"&SUBSTITUTE(SUBSTITUTE(SUBSTITUTE(SUBSTITUTE(TX_EFLHSanAntonio[[#This Row],[Building Type]],\" \",\"\"),\"(\",\"\"),\")\",\"\"),\"/\",\"\")","v":"TXEq24HrQuickService"},"","","Unitary Air Conditioner","Unitary Heat Pump","Packaged Terminal Air Conditioner","Packaged Terminal Heat Pump","Room Air Conditioner","Geothermal Air Conditioner","Geothermal Heat Pump"]
[null,"Retail",1560,781,0.88,null,"Retail",1560,781,0.88,null,null,"Hospital",0.85,0.73,0.94,0,0.89,0.85,0.98,0,3115,4015,3534,0,223,0,{"$f":"\"TXEq\"&SUBSTITUTE(SUBSTITUTE(SUBSTITUTE(SUBSTITUTE(TX_EFLHSanAntonio[[#This Row],[Building Type]],\" \",\"\"),\"(\",\"\"),\")\",\"\"),\"/\",\"\")","v":"TXEqHospital"},"Air Cooled Chiller","Water Cooled Chiller","Unitary Air Conditioner","Unitary Heat Pump","Geothermal Air Conditioner","Geothermal Heat Pump",""]
[null,"School",1494,777,0.71,null,"School",1494,777,0.71,null,null,"Outpatient Healthcare",0.98,0.69,0.86,0,1.06,0.73,0.9,0,2009,2401,2925,0,223,0,{"$f":"\"TXEq\"&SUBSTITUTE(SUBSTITUTE(SUBSTITUTE(SUBSTITUTE(TX_EFLHSanAntonio[[#This Row],[Building Type]],\" \",\"\"),\"(\",\"\"),\")\",\"\"),\"/\",\"\")","v":"TXEqOutpatientHealthcare"},"Air Cooled Chiller","Water Cooled Chiller","Unitary Air Conditioner","Unitary Heat Pump","Geothermal Air Conditioner","Geothermal Heat Pump",""]
[null,null,null,null,null,null,null,null,null,null,null,null,"Midrise Apartment",0.63,0.61,1.05,0,0.66,0.69,1.0900000000000001,0,1378,2528,2429,0,147,0,{"$f":"\"TXEq\"&SUBSTITUTE(SUBSTITUTE(SUBSTITUTE(SUBSTITUTE(TX_EFLHSanAntonio[[#This Row],[Building Type]],\" \",\"\"),\"(\",\"\"),\")\",\"\"),\"/\",\"\")","v":"TXEqMidriseApartment"},"Air Cooled Chiller","Water Cooled Chiller","Unitary Air Conditioner","Unitary Heat Pump","Geothermal Air Conditioner","Geothermal Heat Pump",""]
[null,"OK EFLH Table - Zone 7",null,null,null,null,"AR EFLH Table - Zone 7",null,null,null,null,null,"Large Hotel",0.61,0.68,0.72,0.57999999999999996,0.98,1,0.76,0.61,2595,3180,2600,2117,307,105,{"$f":"\"TXEq\"&SUBSTITUTE(SUBSTITUTE(SUBSTITUTE(SUBSTITUTE(TX_EFLHSanAntonio[[#This Row],[Building Type]],\" \",\"\"),\"(\",\"\"),\")\",\"\"),\"/\",\"\")","v":"TXEqLargeHotel"},"Air Cooled Chiller","Water Cooled Chiller","Unitary Air Conditioner","Unitary Heat Pump","Packaged Terminal Air Conditioner","Packaged Terminal Heat Pump","Room Air Conditioner","Geothermal Air Conditioner","Geothermal Heat Pump"]
[null,"Building Type","Cooling EFLH","Heating EFLH","CF",null,"Building Type","Cooling EFLH","Heating EFLH","CF",null,null,"Nursing Home",0.63,0.61,1.05,0.84,0.66,0.69,1.0900000000000001,0.87,1400,2568,2467,2009,147,33,{"$f":"\"TXEq\"&SUBSTITUTE(SUBSTITUTE(SUBSTITUTE(SUBSTITUTE(TX_EFLHSanAntonio[[#This Row],[Building Type]],\" \",\"\"),\"(\",\"\"),\")\",\"\"),\"/\",\"\")","v":"TXEqNursingHome"},"Air Cooled Chiller","Water Cooled Chiller","Unitary Air Conditioner","Unitary Heat Pump","Packaged Terminal Air Conditioner","Packaged Terminal Heat Pump","Room Air Conditioner","Geothermal Air Conditioner","Geothermal Heat Pump"]
[null,"Assembly",1723,854,0.82,null,"Assembly",1723,854,0.82,null,null,"Small Hotel/Motel",0,0,0.68,0.54,0,0,0.71,0.56999999999999995,0,0,2421,1971,147,50,{"$f":"\"TXEq\"&SUBSTITUTE(SUBSTITUTE(SUBSTITUTE(SUBSTITUTE(TX_EFLHSanAntonio[[#This Row],[Building Type]],\" \",\"\"),\"(\",\"\"),\")\",\"\"),\"/\",\"\")","v":"TXEqSmallHotelMotel"},"","","Unitary Air Conditioner","Unitary Heat Pump","Packaged Terminal Air Conditioner","Packaged Terminal Heat Pump","Room Air Conditioner","Geothermal Air Conditioner","Geothermal Heat Pump"]
[null,"College/University",1450,936,0.84,null,"College/University",1450,936,0.84,null,null,"Stand Alone Retail",0.77,0.68,1,0,0.82,0.76,1.04,0,1184,1652,1554,0,230,0,{"$f":"\"TXEq\"&SUBSTITUTE(SUBSTITUTE(SUBSTITUTE(SUBSTITUTE(TX_EFLHSanAntonio[[#This Row],[Building Type]],\" \",\"\"),\"(\",\"\"),\")\",\"\"),\"/\",\"\")","v":"TXEqStandAloneRetail"},"Air Cooled Chiller","Water Cooled Chiller","Unitary Air Conditioner","Unitary Heat Pump","Geothermal Air Conditioner","Geothermal Heat Pump",""]
[null,"Fast Food Restaurant",1199,439,0.78,null,"Fast Food Restaurant",1199,439,0.78,null,null,"24 Hr Stand Alone Retail",0.81,0.71,1.03,0,0.86,0.79,1.06,0,1642,2488,2059,0,276,0,{"$f":"\"TXEq\"&SUBSTITUTE(SUBSTITUTE(SUBSTITUTE(SUBSTITUTE(TX_EFLHSanAntonio[[#This Row],[Building Type]],\" \",\"\"),\"(\",\"\"),\")\",\"\"),\"/\",\"\")","v":"TXEq24HrStandAloneRetail"},"Air Cooled Chiller","Water Cooled Chiller","Unitary Air Conditioner","Unitary Heat Pump","Geothermal Air Conditioner","Geothermal Heat Pump",""]
[null,"Full Menu Restaurant",1661,321,0.85,null,"Full Menu Restaurant",1661,321,0.85,null,null,"Strip Mall",0,0,0.97,0.78,0,0,1.02,0.82,0,0,1467,1194,247,84,{"$f":"\"TXEq\"&SUBSTITUTE(SUBSTITUTE(SUBSTITUTE(SUBSTITUTE(TX_EFLHSanAntonio[[#This Row],[Building Type]],\" \",\"\"),\"(\",\"\"),\")\",\"\"),\"/\",\"\")","v":"TXEqStripMall"},"","","Unitary Air Conditioner","Unitary Heat Pump","Packaged Terminal Air Conditioner","Packaged Terminal Heat Pump","Room Air Conditioner","Geothermal Air Conditioner","Geothermal Heat Pump"]
[null,"Grocery Store",1361,941,0.9,null,"Grocery Store",1361,941,0.9,null,null,"Large Office",0.98,0.69,1.07,0,1.06,0.73,1.0900000000000001,0,2009,2401,2866,0,175,0,{"$f":"\"TXEq\"&SUBSTITUTE(SUBSTITUTE(SUBSTITUTE(SUBSTITUTE(TX_EFLHSanAntonio[[#This Row],[Building Type]],\" \",\"\"),\"(\",\"\"),\")\",\"\"),\"/\",\"\")","v":"TXEqLargeOffice"},"Air Cooled Chiller","Water Cooled Chiller","Unitary Air Conditioner","Unitary Heat Pump","Geothermal Air Conditioner","Geothermal Heat Pump",""]
[null,"Health Clinic",1379,878,0.85,null,"Health Clinic",1379,878,0.85,null,null,"Medium Office",0.98,0.69,0.83,0,1.06,0.73,0.9,0,2009,2401,1523,0,107,0,{"$f":"\"TXEq\"&SUBSTITUTE(SUBSTITUTE(SUBSTITUTE(SUBSTITUTE(TX_EFLHSanAntonio[[#This Row],[Building Type]],\" \",\"\"),\"(\",\"\"),\")\",\"\"),\"/\",\"\")","v":"TXEqMediumOffice"},"Air Cooled Chiller","Water Cooled Chiller","Unitary Air Conditioner","Unitary Heat Pump","Geothermal Air Conditioner","Geothermal Heat Pump",""]
[null,"Lodging",1258,589,0.77,null,"Lodging",1258,589,0.77,null,null,"Small Office",0,0,1,0.8,0,0,1.05,0.84,0,0,1598,1301,147,50,{"$f":"\"TXEq\"&SUBSTITUTE(SUBSTITUTE(SUBSTITUTE(SUBSTITUTE(TX_EFLHSanAntonio[[#This Row],[Building Type]],\" \",\"\"),\"(\",\"\"),\")\",\"\"),\"/\",\"\")","v":"TXEqSmallOffice"},"","","Unitary Air Conditioner","Unitary Heat Pump","Packaged Terminal Air Conditioner","Packaged Terminal Heat Pump","Room Air Conditioner","Geothermal Air Conditioner","Geothermal Heat Pump"]
[null,"Large Office (>30k SqFt)",2112,1020,0.84,null,"Large Office (>30k SqFt)",2112,1020,0.84,null,null,"Public Assembly",0.55000000000000004,0.57999999999999996,1.06,0,0.6,0.63,1.1000000000000001,0,1231,2307,2196,0,107,0,{"$f":"\"TXEq\"&SUBSTITUTE(SUBSTITUTE(SUBSTITUTE(SUBSTITUTE(TX_EFLHSanAntonio[[#This Row],[Building Type]],\" \",\"\"),\"(\",\"\"),\")\",\"\"),\"/\",\"\")","v":"TXEqPublicAssembly"},"Air Cooled Chiller","Water Cooled Chiller","Unitary Air Conditioner","Unitary Heat Pump","Geothermal Air Conditioner","Geothermal Heat Pump",""]
[null,"Small Office (<=30k SqFt)",1486,534,0.84,null,"Small Office (<=30k SqFt)",1486,534,0.84,null,null,"Religious Worship",0.77,0.68,0.68,0,0.82,0.76,0.71,0,713,994,602,0,107,0,{"$f":"\"TXEq\"&SUBSTITUTE(SUBSTITUTE(SUBSTITUTE(SUBSTITUTE(TX_EFLHSanAntonio[[#This Row],[Building Type]],\" \",\"\"),\"(\",\"\"),\")\",\"\"),\"/\",\"\")","v":"TXEqReligiousWorship"},"Air Cooled Chiller","Water Cooled Chiller","Unitary Air Conditioner","Unitary Heat Pump","Geothermal Air Conditioner","Geothermal Heat Pump",""]
[null,"Religious Worship",1537,798,0.82,null,"Religious Worship",1537,798,0.82,null,null,"Service",0.55000000000000004,0.57999999999999996,1.06,0,0.6,0.63,1.1299999999999999,0,713,994,1742,0,107,0,{"$f":"\"TXEq\"&SUBSTITUTE(SUBSTITUTE(SUBSTITUTE(SUBSTITUTE(TX_EFLHSanAntonio[[#This Row],[Building Type]],\" \",\"\"),\"(\",\"\"),\")\",\"\"),\"/\",\"\")","v":"TXEqService"},"Air Cooled Chiller","Water Cooled Chiller","Unitary Air Conditioner","Unitary Heat Pump","Geothermal Air Conditioner","Geothermal Heat Pump",""]
[null,"Retail",1291,1043,0.88,null,"Retail",1291,1043,0.88,null,null,"Warehouse",0.55000000000000004,0.57999999999999996,0.92,0,0.6,0.63,1.05,0,713,994,718,0,107,0,{"$f":"\"TXEq\"&SUBSTITUTE(SUBSTITUTE(SUBSTITUTE(SUBSTITUTE(TX_EFLHSanAntonio[[#This Row],[Building Type]],\" \",\"\"),\"(\",\"\"),\")\",\"\"),\"/\",\"\")","v":"TXEqWarehouse"},"Air Cooled Chiller","Water Cooled Chiller","Unitary Air Conditioner","Unitary Heat Pump","Geothermal Air Conditioner","Geothermal Heat Pump",""]
[null,"School",1233,1030,0.71,null,"School",1233,1030,0.71,null,null,"Other",0.55000000000000004,0.57999999999999996,0.61,0,0.6,0.63,0.65,0,713,994,602,0,107,0,{"$f":"\"TXEq\"&SUBSTITUTE(SUBSTITUTE(SUBSTITUTE(SUBSTITUTE(TX_EFLHSanAntonio[[#This Row],[Building Type]],\" \",\"\"),\"(\",\"\"),\")\",\"\"),\"/\",\"\")","v":"TXEqOther"},"Air Cooled Chiller","Water Cooled Chiller","Unitary Air Conditioner","Unitary Heat Pump","Geothermal Air Conditioner","Geothermal Heat Pump",""]
[]
[null,"OK EFLH Table - Zone 8",null,null,null,null,"AR EFLH Table - Zone 8"]
[null,"Building Type","Cooling EFLH","Heating EFLH","CF",null,"Building Type","Cooling EFLH","Heating EFLH","CF"]
[null,"Assembly",1632,915,0.82,null,"Assembly",1632,915,0.82]
[null,"College/University",1374,1002,0.84,null,"College/University",1374,1002,0.84]
[null,"Fast Food Restaurant",1170,472,0.78,null,"Fast Food Restaurant",1170,472,0.78]
[null,"Full Menu Restaurant",1640,362,0.85,null,"Full Menu Restaurant",1640,362,0.85]
[null,"Grocery Store",1300,1001,0.9,null,"Grocery Store",1300,1001,0.9]
[null,"Health Clinic",1368,915,0.85,null,"Health Clinic",1368,915,0.85]
[null,"Lodging",1274,637,0.77,null,"Lodging",1274,637,0.77]
[null,"Large Office (>30k SqFt)",1957,1060,0.84,null,"Large Office (>30k SqFt)",1957,1060,0.84]
[null,"Small Office (<=30k SqFt)",1448,564,0.84,null,"Small Office (<=30k SqFt)",1448,564,0.84]
[null,"Religious Worship",1456,854,0.82,null,"Religious Worship",1456,854,0.82]
[null,"Retail",1214,1133,0.88,null,"Retail",1214,1133,0.88]
[null,"School",1183,1094,0.71,null,"School",1183,1094,0.71]
[]
[null,"OK EFLH Table - Zone 9",null,null,null,null,"AR EFLH Table - Zone 9"]
[null,"Building Type","Cooling EFLH","Heating EFLH","CF",null,"Building Type","Cooling EFLH","Heating EFLH","CF"]
[null,"Assembly",1287,1032,0.82,null,"Assembly",1287,1032,0.82]
[null,"College/University",1083,1130,0.84,null,"College/University",1083,1130,0.84]
[null,"Fast Food Restaurant",968,549,0.78,null,"Fast Food Restaurant",968,549,0.78]
[null,"Full Menu Restaurant",1512,438,0.85,null,"Full Menu Restaurant",1512,438,0.85]
[null,"Grocery Store",1030,1129,0.9,null,"Grocery Store",1030,1129,0.9]
[null,"Health Clinic",1144,1045,0.85,null,"Health Clinic",1144,1045,0.85]
[null,"Lodging",1144,722,0.77,null,"Lodging",1144,722,0.77]
[null,"Large Office (>30k SqFt)",1588,1157,0.84,null,"Large Office (>30k SqFt)",1588,1157,0.84]
[null,"Small Office (<=30k SqFt)",1207,644,0.84,null,"Small Office (<=30k SqFt)",1207,644,0.84]
[null,"Religious Worship",1148,963,0.82,null,"Religious Worship",1148,963,0.82]
[null,"Retail",965,1287,0.88,null,"Retail",965,1287,0.88]
[null,"School",932,1236,0.71,null,"School",932,1236,0.71]

{"sheet":"Utility Admin","index":18,"n_rows":53,"n_cols":60,"rows_kept":53,"cut":false,"hidden":true,"merged":[]}
[null,null,null,null,null,null,null,null,null,null,null,null,null,null,null,"$/NCP",null,null,null,null,null,null,null,null,null,null,null,null,null,null,"$/kW",null,null,null,null,null,null,null,null,null,null,null,null,null,null,"$/kWh"]
[{"$f":"'Project Info'!D7","v":0},{"$f":"'Project Info'!I7","v":0},{"$f":"A2&B2","v":"00"},{"$f":"INDEX('Utility Admin'!D4:D22,MATCH($C$2,'Utility Admin'!$C$4:$C$22,0))","v":{"$error":"#N/A"}},{"$f":"'Project Info'!I8","v":0},{"$f":"C2&E2","v":"000"},{"$f":"INDEX('Utility Admin'!G4:G22,MATCH($F$2,'Utility Admin'!$F$4:$F$22,0))","v":{"$error":"#N/A"}},{"$f":"INDEX('Utility Admin'!H4:H22,MATCH($F$2,'Utility Admin'!$F$4:$F$22,0))","v":{"$error":"#N/A"}},{"$f":"INDEX('Utility Admin'!I4:I22,MATCH($F$2,'Utility Admin'!$F$4:$F$22,0))","v":{"$error":"#N/A"}},{"$f":"INDEX('Utility Admin'!J4:J22,MATCH($F$2,'Utility Admin'!$F$4:$F$22,0))","v":{"$error":"#N/A"}},{"$f":"INDEX('Utility Admin'!K4:K22,MATCH($F$2,'Utility Admin'!$F$4:$F$22,0))","v":{"$error":"#N/A"}},{"$f":"INDEX('Utility Admin'!L4:L22,MATCH($F$2,'Utility Admin'!$F$4:$F$22,0))","v":{"$error":"#N/A"}},{"$f":"INDEX('Utility Admin'!M4:M22,MATCH($F$2,'Utility Admin'!$F$4:$F$22,0))","v":{"$error":"#N/A"}},{"$f":"INDEX('Utility Admin'!N4:N22,MATCH($F$2,'Utility Admin'!$F$4:$F$22,0))","v":{"$error":"#N/A"}},{"$f":"INDEX('Utility Admin'!O4:O22,MATCH($F$2,'Utility Admin'!$F$4:$F$22,0))","v":{"$error":"#N/A"}},{"$f":"INDEX('Utility Admin'!P4:P22,MATCH($F$2,'Utility Admin'!$F$4:$F$22,0))","v":{"$error":"#N/A"}},{"$f":"INDEX('Utility Admin'!Q4:Q22,MATCH($F$2,'Utility Admin'!$F$4:$F$22,0))","v":{"$error":"#N/A"}},{"$f":"INDEX('Utility Admin'!R4:R22,MATCH($F$2,'Utility Admin'!$F$4:$F$22,0))","v":{"$error":"#N/A"}},{"$f":"INDEX('Utility Admin'!S4:S22,MATCH($F$2,'Utility Admin'!$F$4:$F$22,0))","v":{"$error":"#N/A"}},{"$f":"INDEX('Utility Admin'!T4:T22,MATCH($F$2,'Utility Admin'!$F$4:$F$22,0))","v":{"$error":"#N/A"}},{"$f":"INDEX('Utility Admin'!U4:U22,MATCH($F$2,'Utility Admin'!$F$4:$F$22,0))","v":{"$error":"#N/A"}},{"$f":"INDEX('Utility Admin'!V4:V22,MATCH($F$2,'Utility Admin'!$F$4:$F$22,0))","v":{"$error":"#N/A"}},{"$f":"INDEX('Utility Admin'!W4:W22,MATCH($F$2,'Utility Admin'!$F$4:$F$22,0))","v":{"$error":"#N/A"}},{"$f":"INDEX('Utility Admin'!X4:X22,MATCH($F$2,'Utility Admin'!$F$4:$F$22,0))","v":{"$error":"#N/A"}},{"$f":"INDEX('Utility Admin'!Y4:Y22,MATCH($F$2,'Utility Admin'!$F$4:$F$22,0))","v":{"$error":"#N/A"}},{"$f":"INDEX('Utility Admin'!Z4:Z22,MATCH($F$2,'Utility Admin'!$F$4:$F$22,0))","v":{"$error":"#N/A"}},{"$f":"INDEX('Utility Admin'!AA4:AA22,MATCH($F$2,'Utility Admin'!$F$4:$F$22,0))","v":{"$error":"#N/A"}},{"$f":"INDEX('Utility Admin'!AB4:AB22,MATCH($F$2,'Utility Admin'!$F$4:$F$22,0))","v":{"$error":"#N/A"}},{"$f":"INDEX('Utility Admin'!AC4:AC22,MATCH($F$2,'Utility Admin'!$F$4:$F$22,0))","v":{"$error":"#N/A"}},{"$f":"INDEX('Utility Admin'!AD4:AD22,MATCH($F$2,'Utility Admin'!$F$4:$F$22,0))","v":{"$error":"#N/A"}},{"$f":"INDEX('Utility Admin'!AE4:AE22,MATCH($F$2,'Utility Admin'!$F$4:$F$22,0))","v":{"$error":"#N/A"}},{"$f":"INDEX('Utility Admin'!AF4:AF22,MATCH($F$2,'Utility Admin'!$F$4:$F$22,0))","v":{"$error":"#N/A"}},{"$f":"INDEX('Utility Admin'!AG4:AG22,MATCH($F$2,'Utility Admin'!$F$4:$F$22,0))","v":{"$error":"#N/A"}},{"$f":"INDEX('Utility Admin'!AH4:AH22,MATCH($F$2,'Utility Admin'!$F$4:$F$22,0))","v":{"$error":"#N/A"}},{"$f":"INDEX('Utility Admin'!AI4:AI22,MATCH($F$2,'Utility Admin'!$F$4:$F$22,0))","v":{"$error":"#N/A"}},{"$f":"INDEX('Utility Admin'!AJ4:AJ22,MATCH($F$2,'Utility Admin'!$F$4:$F$22,0))","v":{"$error":"#N/A"}},{"$f":"INDEX('Utility Admin'!AK4:AK22,MATCH($F$2,'Utility Admin'!$F$4:$F$22,0))","v":{"$error":"#N/A"}},{"$f":"INDEX('Utility Admin'!AL4:AL22,MATCH($F$2,'Utility Admin'!$F$4:$F$22,0))","v":{"$error":"#N/A"}},{"$f":"INDEX('Utility Admin'!AM4:AM22,MATCH($F$2,'Utility Admin'!$F$4:$F$22,0))","v":{"$error":"#N/A"}},{"$f":"INDEX('Utility Admin'!AN4:AN22,MATCH($F$2,'Utility Admin'!$F$4:$F$22,0))","v":{"$error":"#N/A"}},{"$f":"INDEX('Utility Admin'!AO4:AO22,MATCH($F$2,'Utility Admin'!$F$4:$F$22,0))","v":{"$error":"#N/A"}},{"$f":"INDEX('Utility Admin'!AP4:AP22,MATCH($F$2,'Utility Admin'!$F$4:$F$22,0))","v":{"$error":"#N/A"}},{"$f":"INDEX('Utility Admin'!AQ4:AQ22,MATCH($F$2,'Utility Admin'!$F$4:$F$22,0))","v":{"$error":"#N/A"}},{"$f":"INDEX('Utility Admin'!AR4:AR22,MATCH($F$2,'Utility Admin'!$F$4:$F$22,0))","v":{"$error":"#N/A"}},{"$f":"INDEX('Utility Admin'!AS4:AS22,MATCH($F$2,'Utility Admin'!$F$4:$F$22,0))","v":{"$error":"#N/A"}},{"$f":"INDEX('Utility Admin'!AT4:AT22,MATCH($F$2,'Utility Admin'!$F$4:$F$22,0))","v":{"$error":"#N/A"}},{"$f":"INDEX('Utility Admin'!AU4:AU22,MATCH($F$2,'Utility Admin'!$F$4:$F$22,0))","v":{"$error":"#N/A"}},{"$f":"INDEX('Utility Admin'!AV4:AV22,MATCH($F$2,'Utility Admin'!$F$4:$F$22,0))","v":{"$error":"#N/A"}},{"$f":"INDEX('Utility Admin'!AW4:AW22,MATCH($F$2,'Utility Admin'!$F$4:$F$22,0))","v":{"$error":"#N/A"}},{"$f":"INDEX('Utility Admin'!AX4:AX22,MATCH($F$2,'Utility Admin'!$F$4:$F$22,0))","v":{"$error":"#N/A"}},{"$f":"INDEX('Utility Admin'!AY4:AY22,MATCH($F$2,'Utility Admin'!$F$4:$F$22,0))","v":{"$error":"#N/A"}},{"$f":"INDEX('Utility Admin'!AZ4:AZ22,MATCH($F$2,'Utility Admin'!$F$4:$F$22,0))","v":{"$error":"#N/A"}},{"$f":"INDEX('Utility Admin'!BA4:BA22,MATCH($F$2,'Utility Admin'!$F$4:$F$22,0))","v":{"$error":"#N/A"}},{"$f":"INDEX('Utility Admin'!BB4:BB22,MATCH($F$2,'Utility Admin'!$F$4:$F$22,0))","v":{"$error":"#N/A"}},{"$f":"INDEX('Utility Admin'!BC4:BC22,MATCH($F$2,'Utility Admin'!$F$4:$F$22,0))","v":{"$error":"#N/A"}},{"$f":"INDEX('Utility Admin'!BD4:BD22,MATCH($F$2,'Utility Admin'!$F$4:$F$22,0))","v":{"$error":"#N/A"}},{"$f":"INDEX('Utility Admin'!BE4:BE22,MATCH($F$2,'Utility Admin'!$F$4:$F$22,0))","v":{"$error":"#N/A"}},{"$f":"INDEX('Utility Admin'!BF4:BF22,MATCH($F$2,'Utility Admin'!$F$4:$F$22,0))","v":{"$error":"#N/A"}},{"$f":"INDEX('Utility Admin'!BG4:BG22,MATCH($F$2,'Utility Admin'!$F$4:$F$22,0))","v":{"$error":"#N/A"}},{"$f":"INDEX('Utility Admin'!BH4:BH22,MATCH($F$2,'Utility Admin'!$F$4:$F$22,0))","v":{"$error":"#N/A"}}]
["State","Utilities",null,null,null,null,"Abs Cap","% Cap",null,"Early Retirement?","TRM","ACkW","ACkWh","discount","escalation","Air Cooled Chiller","Water Cooled Chiller","Unitary Air Conditioner","Unitary Heat Pump","Packaged Terminal Air Conditioner","Packaged Terminal Heat Pump","Room Air Conditioner","Room Heat Pump","VRF Air Conditioner","VRF Heat Pump","Single Package Vertical Air Conditioner","Single Package Vertical Heat Pump","Computer Room AC","Geothermal Air Conditioner","Geothermal Heat Pump","Air Cooled Chiller","Water Cooled Chiller","Unitary Air Conditioner","Unitary Heat Pump","Packaged Terminal Air Conditioner","Packaged Terminal Heat Pump","Room Air Conditioner","Room Heat Pump","VRF Air Conditioner","VRF Heat Pump","Single Package Vertical Air Conditioner","Single Package Vertical Heat Pump","Computer Room AC","Geothermal Air Conditioner","Geothermal Heat Pump","Air Cooled Chiller","Water Cooled Chiller","Unitary Air Conditioner","Unitary Heat Pump","Packaged Terminal Air Conditioner","Packaged Terminal Heat Pump","Room Air Conditioner","Room Heat Pump","VRF Air Conditioner","VRF Heat Pump","Single Package Vertical Air Conditioner","Single Package Vertical Heat Pump","Computer Room AC","Geothermal Air Conditioner","Geothermal Heat Pump"]
["LA","CLECO",{"$f":"A4&B4","v":"LACLECO"},"CLECO","Large C&I",{"$f":"C4&E4","v":"LACLECOLarge C&I"},25000,1,{"$f":"IF('Project Info'!$D$17=\"\",G4,MIN(H4*'Project Info'!$D$17,G4))","v":25000},"ERNo","ARTRM3",null,null,null,null,null,null,null,null,null,null,null,null,null,null,null,null,null,null,null,null,null,null,null,null,null,null,null,null,null,null,null,null,null,null,0.15,0.15,0.15,0.15,0.15,0.15,0.15,0.15,0.15,0.15,0.15,0.15]
["LA","CLECO","LACLECO","CLECO","Small Business","LACLECOSmall Business",25000,1,{"$f":"IF('Project Info'!$D$17=\"\",G5,MIN(H5*'Project Info'!$D$17,G5))","v":25000},"ERNo","ARTRM3",null,null,null,null,null,null,null,null,null,null,null,null,null,null,null,null,null,null,null,null,null,null,null,null,null,null,null,null,null,null,null,null,null,null,0.16,0.16,0.16,0.16,0.16,0.16,0.16,0.16,0.16,0.16,0.16,0.16]
["LA","Entergy Gulf States","LAEntergy Gulf States","EGSL","Large C&I","LAEntergy Gulf StatesLarge C&I",25000,1,{"$f":"IF('Project Info'!$D$17=\"\",G6,MIN(H6*'Project Info'!$D$17,G6))","v":25000},"ERNo","ARTRM3",null,null,null,null,null,null,null,null,null,null,null,null,null,null,null,null,null,null,null,null,null,null,null,null,null,null,null,null,null,null,null,null,null,null,0.15,0.15,0.15,0.15,0.15,0.15,0.15,0.15,0.15,0.15,0.15,0.15]
["LA","Entergy Gulf States",{"$f":"A7&B7","v":"LAEntergy Gulf States"},"EGSL","Small Business","LAEntergy Gulf StatesSmall Business",25000,1,{"$f":"IF('Project Info'!$D$17=\"\",G7,MIN(H7*'Project Info'!$D$17,G7))","v":25000},"ERNo","ARTRM3",null,null,null,null,null,null,null,null,null,null,null,null,null,null,null,null,null,null,null,null,null,null,null,null,null,null,null,null,null,null,null,null,null,null,0.16,0.16,0.16,0.16,0.16,0.16,0.16,0.16,0.16,0.16,0.16,0.16]
["LA","Entergy Louisiana","LAEntergy Louisiana","ELL","Large C&I","LAEntergy LouisianaLarge C&I",25000,1,{"$f":"IF('Project Info'!$D$17=\"\",G8,MIN(H8*'Project Info'!$D$17,G8))","v":25000},"ERNo","ARTRM3",null,null,null,null,null,null,null,null,null,null,null,null,null,null,null,null,null,null,null,null,null,null,null,null,null,null,null,null,null,null,null,null,null,null,0.15,0.15,0.15,0.15,0.15,0.15,0.15,0.15,0.15,0.15,0.15,0.15]
["LA","Entergy Louisiana",{"$f":"A9&B9","v":"LAEntergy Louisiana"},"ELL","Small Business","LAEntergy LouisianaSmall Business",25000,1,{"$f":"IF('Project Info'!$D$17=\"\",G9,MIN(H9*'Project Info'!$D$17,G9))","v":25000},"ERNo","ARTRM3",null,null,null,null,null,null,null,null,null,null,null,null,null,null,null,null,null,null,null,null,null,null,null,null,null,null,null,null,null,null,null,null,null,null,0.16,0.16,0.16,0.16,0.16,0.16,0.16,0.16,0.16,0.16,0.16,0.16]
["LA","Entergy New Orleans","LAEntergy New Orleans","ENO","Large C&I","LAEntergy New OrleansLarge C&I",50000,1,{"$f":"IF('Project Info'!$D$17=\"\",G10,MIN(H10*'Project Info'!$D$17,G10))","v":50000},"ERNo","ARTRM3",null,null,null,null,null,null,null,null,null,null,null,null,null,null,null,null,null,null,null,null,null,null,null,null,null,null,null,null,null,null,null,null,null,null,0.12,0.12,0.12,0.12,0.12,0.12,0.12,0.12,0.12,0.12,0.12,0.12]
["LA","Entergy New Orleans",{"$f":"A11&B11","v":"LAEntergy New Orleans"},"ENO","Small Business","LAEntergy New OrleansSmall Business",50000,1,{"$f":"IF('Project Info'!$D$17=\"\",G11,MIN(H11*'Project Info'!$D$17,G11))","v":50000},"ERNo","ARTRM3",null,null,null,null,null,null,null,null,null,null,null,null,null,null,null,null,null,null,null,null,null,null,null,null,null,null,null,null,null,null,null,null,null,null,0.12,0.12,0.12,0.12,0.12,0.12,0.12,0.12,0.12,0.12,0.12,0.12]
["LA","SWEPCO Louisiana","LASWEPCO Louisiana","SWEPCOLA","Large C&I","LASWEPCO LouisianaLarge C&I",{"$f":"MIN(30000,MAX(5000,ROUNDDOWN(Inventory!AO3*1000,-3)))","v":5000},0.8,{"$f":"IF('Project Info'!$D$17=\"\",G12,MIN(H12*'Project Info'!$D$17,G12))","v":5000},"ERNo","ARTRM3",null,null,null,null,null,null,null,null,null,null,null,null,null,null,null,null,null,null,null,null,null,null,null,null,null,null,null,null,null,null,null,null,null,null,0.15,0.15,0.15,0.15,0.15,0.15,0.15,0.15,0.15,0.15,0.15,0.15]
["TX","CPS Energy","TXCPS Energy","CPS","Large C&I","TXCPS EnergyLarge C&I",999999,0.75,{"$f":"IF('Project Info'!$D$17=\"\",G13,MIN(H13*'Project Info'!$D$17,G13))","v":999999},"ERYes","CPS",81.569999999999993,4.5199999999999997E-2,6.6000000000000003E-2,0.02,525,525,350,350,350,350,350,350,350,350,null,null,350,350,350,null,null,null,null,null,null,null,null,null,null,null,null,null,null,null,0.05,0.05,0.05,0.05,0.05,0.05,0.05,0.05,null,null,null,null,0.05,0.05,0.05]
["TX","CPS Energy","TXCPS Energy","CPS","Schools & Institutions","TXCPS EnergySchools & Institutions",999999,0.75,{"$f":"IF('Project Info'!$D$17=\"\",G14,MIN(H14*'Project Info'!$D$17,G14))","v":999999},"ERYes","CPS",81.569999999999993,4.5199999999999997E-2,6.6000000000000003E-2,0.02,525,525,350,350,350,350,350,350,350,350,null,null,350,350,350,null,null,null,null,null,null,null,null,null,null,null,null,null,null,null,0.05,0.05,0.05,0.05,0.05,0.05,0.05,0.05,null,null,null,null,0.05,0.05,0.05]
["TX","CPS Energy",{"$f":"A15&B15","v":"TXCPS Energy"},"CPS","Small Business","TXCPS EnergySmall Business",999999,0.8,{"$f":"IF('Project Info'!$D$17=\"\",G15,MIN(H15*'Project Info'!$D$17,G15))","v":999999},"ERYes","CPS",81.569999999999993,4.5199999999999997E-2,6.6000000000000003E-2,0.02,550,550,550,550,550,550,550,550,550,550,null,null,550,550,550,null,null,null,null,null,null,null,null,null,null,null,null,null,null,null,0,0,0,0,0,0,0,0,null,null,null,null,0,0,0]
["MS","Mississippi Power","MSMississippi Power","MSP","Large C&I","MSMississippi PowerLarge C&I",30000,1,{"$f":"IF('Project Info'!$D$17=\"\",G16,MIN(H16*'Project Info'!$D$17,G16))","v":30000},"ERNo","ARTRM3",null,null,null,null,null,null,null,null,null,null,null,null,null,null,null,null,null,null,null,null,null,null,null,null,null,null,null,null,null,null,null,null,null,null,0.12,0.12,0.12,0.12,0.12,0.12,0.12,0.12,0.12,0.12,0.12,0.12]
["MS","Mississippi Power",{"$f":"A17&B17","v":"MSMississippi Power"},"MSP","Small Business","MSMississippi PowerSmall Business",999999,0.9,{"$f":"IF('Project Info'!$D$17=\"\",G17,MIN(H17*'Project Info'!$D$17,G17))","v":999999},"ERNo","ARTRM3",null,null,null,null,null,null,null,null,null,null,null,null,null,null,null,null,null,null,null,null,null,null,null,null,null,null,null,null,null,null,null,null,null,null,0.16,0.16,0.16,0.16,0.16,0.16,0.16,0.16,0.16,0.16,0.16,0.16]
["OK","Oklahoma Gas & Electric","OKOklahoma Gas & Electric","OGEOK","Large C&I","OKOklahoma Gas & ElectricLarge C&I",999999,0.5,{"$f":"IF('Project Info'!$D$17=\"\",G18,MIN(H18*'Project Info'!$D$17,G18))","v":999999},"ERNo","ARTRM8",null,null,null,null,null,null,null,null,null,null,null,null,null,null,null,null,null,null,null,null,null,null,null,null,null,null,null,null,null,null,null,null,null,null,0.09,0.09,0.09,0.09,0.09,0.09,0.09,0.09,null,null,null,null,null,0.11,0.11]
["OK","Oklahoma Gas & Electric","OKOklahoma Gas & Electric","OGEOK","Schools & Govt","OKOklahoma Gas & ElectricSchools & Govt",999999,0.9,{"$f":"IF('Project Info'!$D$17=\"\",G19,MIN(H19*'Project Info'!$D$17,G19))","v":999999},"ERNo","ARTRM8",null,null,null,null,null,null,null,null,null,null,null,null,null,null,null,null,null,null,null,null,null,null,null,null,null,null,null,null,null,null,null,null,null,null,0.14000000000000001,0.14000000000000001,0.14000000000000001,0.14000000000000001,0.14000000000000001,0.14000000000000001,0.14000000000000001,0.14000000000000001,null,null,null,null,null,0.11,0.11]
["OK","Oklahoma Gas & Electric",{"$f":"A20&B20","v":"OKOklahoma Gas & Electric"},"OGEOK","Small Business","OKOklahoma Gas & ElectricSmall Business",999999,0.9,{"$f":"IF('Project Info'!$D$17=\"\",G20,MIN(H20*'Project Info'!$D$17,G20))","v":999999},"ERNo","ARTRM8",null,null,null,null,null,null,null,null,null,null,null,null,null,null,null,null,null,null,null,null,null,null,null,null,null,null,null,null,null,null,null,null,null,null,0.09,0.09,0.09,0.09,0.09,0.09,0.09,0.09,null,null,null,null,null,0.11,0.11]
["AR","Oklahoma Gas & Electric","AROklahoma Gas & Electric","OGEAR","Small Business","AROklahoma Gas & ElectricSmall Business",999999,0.9,{"$f":"IF('Project Info'!$D$17=\"\",G21,MIN(H21*'Project Info'!$D$17,G21))","v":999999},"ERNo","ARTRM8",null,null,null,null,null,null,null,null,null,null,null,null,null,null,null,null,null,null,null,null,null,null,null,null,null,null,null,null,null,null,null,null,null,null,0.16,0.16,0.16,0.16,0.16,0.16,0.16,0.16]
["AR","Oklahoma Gas & Electric","AROklahoma Gas & Electric","OGEAR","Commercial Standard Offer Program","AROklahoma Gas & ElectricCommercial Standard Offer Program",999999,0.8,{"$f":"IF('Project Info'!$D$17=\"\",G22,MIN(H22*'Project Info'!$D$17,G22))","v":999999},"ERNo","ARTRM8",null,null,null,null,null,null,null,null,null,null,null,null,null,null,null,null,null,null,null,null,null,null,null,null,null,null,null,null,null,null,null,null,null,null,0.14000000000000001,0.14000000000000001,0.14000000000000001,0.14000000000000001,0.14000000000000001,0.14000000000000001,0.14000000000000001,0.14000000000000001]
[]
["LA","MS","AR","OK","TX"]
["CLECO","Mississippi Power","Oklahoma Gas & Electric","Oklahoma Gas & Electric","CPS Energy"]
["Entergy Gulf States"]
["Entergy Louisiana"]
["Entergy New Orleans"]
["SWEPCO Louisiana"]
[]
[]
[]
[]
[]
[]
[]
[]
[]
[]
[]
[]
[]
[]
[]
[]
[]
[]
[]
[]
[null,"PPI:"]
[null,"Account #:"]
[null,"Name on Account or Tax ID:"]
[null,"PPI Hide Trigger:",true]

{"sheet":"Version Log","index":19,"n_rows":146,"n_cols":6,"rows_kept":146,"cut":false,"hidden":true,"merged":[[1,1,1,5]]}
[]
[null,"Version Log"]
[]
[null,"Original Author:",null,"Adam Keeling","QA/QC Engineer(s):","Boone Drummond"]
[null,"Primary Developer:",null,"Adam Groenhuyzen","Senior Engineer Approval:"]
[]
[null,"Version","Date","Reason for Change","Change Description","Contact, Department"]
[null,null,null,null,"Changed \"ROB\" to \"Replace on Burnout\" for [Application Type] dropdown","Adam Keeling"]
[null,null,null,null,"Add conditional formatting to [Heating Type] to go dark when [Equipment Type 2] is Heat Pump to not ask for heating type"]
[null,null,null,null,"Removed \"Heat Pump\" from dropdown options on [Heating Type]"]
[null,null,null,null,"Add conditional formatting for existing equipment information to go dark when [Project Type] = \"New Construction\""]
[null,null,null,null,"Moved [Cooling Capacity] from Existing Equipment section to New Equipment section"]
[null,null,null,null,"Added \"Unknown\" option to [Existing Equipment Manuf. Year] "]
[null,null,null,null,"Added [Year to Use] that is hidden and pulls from [Existing Equipment Manuf. Year] unless it is \"Unknown\", then uses \"1996\""]
[null,null,null,null,"Changed [Heating Efficiency] dropdown options to \"HSPF\" and \"COP\""]
[null,null,null,null,"Changed formula for [Heating] under Efficiency Requirements section to account for \"HSPF\" and \"COP\" options"]
[null,null,null,null,"Changed ROB baseline, New Construction baseline, and Min. Efficiency lookups to reference New Equipment Type instead of Existing Equipment Type"]
[null,null,null,null,"Added [Eligible?] fields to both heating and cooling sections to ensure New Equipment is greater than Min. Efficiency"]
[null,null,null,null,"Removed all locks to Column C that previously caused all other columns to refer back to 1st equipment type"]
[null,null,null,null,"Changed ends of [Heating Baseline] fields to when [Heating Type] = \"Electric Resistance\", to use 3.516 kW/ton"]
[null,null,null,null,"Changed [New Heating (kW/ton)] to account for new Heating Efficiency options of \"HSPF\" and \"COP\""]
[null,null,null,null,"Changed HSPF to kW/ton conversion from 3.516 to 12"]
[null,null,null,null,"Added 41 and 42 to list"]
[null,null,null,null,"Added option for \"All Systems 5.42 to 11.25 tons\" to dropdown when Unitary Heat Pump"]
[]
[null,null,null,null,"add btuh option"]
[null,null,null,null,"darken fields not needed for entry"]
[null,null,null,null,"add utilities"]
[null,null,null,null,"EFLH - adjust for south zone"]
[null,null,null,null,"add incentive"]
[null,null,null,null,"fix PTAC calcs"]
[null,null,null,null,"added # of units"]
[null,null,null,null,"added incentive caps"]
[null,null,null,null,"added \"Check Min Eff\" message when minimum efficiency requirements not met"]
[null,null,null,null,"add geothermal"]
[null,null,"2015-09-02",null,"Changed EFLH to IECC 2003 zones to match ADM's LA EFLH"]
[null,null,null,null,"MS Zone 7 still using AR TRM Zone 7"]
[null,null,"2015-09-14",null,"MS Zone 6 changed to use AR TRM Zone 6"]
[null,null,null,null,"Updated baseline for <65k Btuh to 14 SEER 8.2 HSPF"]
[null,null,null,null,"Updated RUL tables to match AR TRM"]
[null,null,"2015-09-28",null,"Changed baseline efficiencies for chillers to match AR TRM"]
[null,null,"2015-09-29",null,"Fixed part load baseline lookup for early retirement"]
[null,null,"2016-01-14",null,"Removed Early Retirement option as it does not pass TRC"]
[null,null,null,null,"Fixed Packaged Terminal efficiency calculation"]
[null,null,null,null,"Added Non Standard PTAC and PTHP"]
[null,null,null,null,"Added OK counties and OG&E"]
[null,null,null,null,"Removed Geothermal since they are not in AR TRM"]
[null,null,null,null,"Added heating type when DX Unitary AC"]
[null,null,"2016-02-24",null,"Added VRF"]
[null,null,null,null,"Removed repetition of entering size when selecting type"]
[null,null,null,null,"Fixed kWh heat"]
[null,null,null,null,"Removed non-relevant efficiencies (e.g. PL for PTAC, Room)"]
[null,null,null,null,"<65k baseline to 13"]
[null,null,"2016-03-08",null,"Fixed AC>760k"]
[null,null,null,null,"Required AC in order to have heating type options"]
[null,null,null,null,"Allowed EER to be selected for Room Heat Pump"]
[null,null,null,null,"Swapped state and utility selection"]
[null,null,null,null,"Limited Program selection based on utility"]
[null,null,null,null,"Fixed VRF <65k calc"]
[null,null,"2016-03-14",null,"Added language to Report to warn of incentive caps"]
[null,null,"2016-03-21",null,"Added Heating type when DX Unitary HP"]
[null,null,null,null,"Converted all 3.516 to 12/3.412 for consistency in rounding with the AR TRM"]
[null,null,"2016-05-02",null,"added OG&E AR"]
[null,null,null,null,"OG&E OK Schools & Govt cap changed to 90%"]
[null,null,null,null,"Fixed total sum on Inventory sheet"]
[null,null,null,null,"Removed non-AR TRM measures from OK and AR"]
[null,null,"2016-05-05",null,"Fixed incentive lookups and cap lookups"]
[null,null,"2016-07-11",null,"Added CPS, EFLH tables, counties, programs, equipment type"]
[null,null,"2016-08-03",null,"added early retirement for CPS"]
[null,null,null,null,"Added Room AC casement only and casement sliders"]
[null,null,"2016-08-18",null,"Corrected economic inputs for CPS (discount rate, avoided costs, escalation)"]
[null,null,"2016-08-22",null,"Added IECC 2015 for CPS"]
[null,null,"2016-08-31",null,"Updated EFLH and CF and NCP for CPS"]
[null,null,null,null,"Changed NCP savings calcs to use part-load instead of full-load efficiencies"]
[null,null,"2016-09-07",null,"Changed EFLHh for CPS to Frontier values"]
[null,null,null,null,"Changed CPS incentive caps"]
[null,null,"2016-09-09",null,"Set EFLHh and PTAC coefficients for CPS"]
[null,null,"2016-09-20",null,"Set all factors for PTACs to Frontier values"]
[null,null,"2016-10-25",null,"Change NCP savings calcs back to using full-load"]
[null,null,null,null,"Update EFLH, CF, and NCP to guidebook"]
[null,"16.1.3","2016-11-18",null,"Added small business programs for LAMS and CPS"]
[null,null,null,null,"Fixed bug on Report sheet - existing kW and kWh use was wrong (H49:I49)"]
[null,null,null,null,"Added Path B chiller baselines"]
[null,null,null,null,"Divided split AC under 65k into 1 phase and 3 phase for TX/CPS"]
[null,null,null,null,"Added new tier for 300-600 tons for WCC for IECC2015"]
[null,null,null,null,"updated SWEPCO LA incentive cap to be based on kW"]
[null,null,null,null,"Changed Room AC to use PTAC factors for CPS"]
[null,null,null,null,"added \"Redundant Chiller\", CAF factor, and use part-load eff for kW if redundant"]
[null,null,null,null,"changed early retirement savings calcs to use existing capacity"]
[null,null,null,null,"added heating capacity input and changed kWh heating to use it"]
[null,null,null,null,"added adjustment for ACC to WCC early retirement measures to subtract cooling tower and pump"]
[null,"17.1.1","2016-12-19",null,"turned off screen updating in macro"]
[null,null,null,null,"added OG&E AR small biz"]
[null,null,"2016-12-21",null,"added quantity for early retirement. Changed savings calcs to depend on it."]
[null,null,"2016-12-23",null,"Added assumed age of equipment if unknown"]
[null,null,null,null,"Added check for capacity to be within 80% and 120% or pre capacity if early retirement"]
[null,null,null,null,"moved EUL and RUL to Equipment Lookups"]
[null,null,null,null,"Fixed data validation on equipment type"]
[null,"17.1.2","2017-03-15",null,"Fixed issue of ER from AC to HP not giving heating savings","Adam Groenhuzyen"]
[null,"17.2.1","2017-04-20",null,"Added sheet progression","Adam Groenhuzyen"]
[null,null,"2017-05-05",null,"added equipment type for acch, centrifugal has different ML. Also combined reciprocating & screw/scroll for wcch.","Adam Groenhuzyen"]
[null,null,null,null,"Expanded to 25 rows","Adam Groenhuzyen"]
[null,null,null,null,"changed efficiency unit lookup to depend on equipment type","Adam Groenhuzyen"]
[null,"17.2.2","2017-05-16",null,"updated OG&E AR incentive rates","Adam Groenhuzyen"]
[null,"17.2.3","2017-06-02",null,"fixed lookup error for pre retrofit chillers","Adam Groenhuzyen"]
[null,"17.2.4","2017-07-19",null,"Serial #'s turn red if there are duplicates. Added macros to show/hide chiller-related columns and heating capacity columns unless there is a chiller or a heat pump, respectively, in the inventory. ","Adam Groenhuzyen"]
[null,"18.0.0","2017-10-20",null,"Added Summary tab","Adam Groenhuzyen"]
[null,null,null,null,"Fixed error where room AC's/PTACs were not showing demand savings","Adam Groenhuzyen"]
[null,null,"2017-11-21",null,"Updated OK/AR EFLH's for AR TRM 7","Adam Groenhuzyen"]
[null,"18.0.1","2018-02-15",null,"Updated ChangeLog to CR VersionLog format","Adam Groenhuzyen"]
[null,null,null,null,"changed \"minimum efficiency requirement\" columns to show 3 decimals for kW/ton","Adam Groenhuzyen"]
[null,"18.1.0","2018-02-22",null,"Added updates for 2018-2019 CPS Guidebook","Adam Groenhuzyen"]
[null,"18.1.1","2018-06-25",null,"Fixed error with TX equipment lookups","Adam Groenhuzyen"]
[null,null,null,null,"Updated efficienies for IECC2009 HP <65kbtuh to match 2015+ values","Adam Groenhuzyen"]
[null,null,null,null,"Changed Early Retirement calculations to use version year rather than current year (to prevent issues of savings changing when re-opening file in a future year)","Adam Groenhuzyen"]
[null,"18.1.2","2018-07-25",null,"Updated heating efficienies for IECC2009 HP <65kbtuh to match 2015+ values","Adam Groenhuzyen"]
[null,"18.2.0","2018-08-24",null,"Added HidePPI Macro","Adam Groenhuzyen"]
[null,null,null,null,"Removed ER manuf years that are all ROB now."]
[null,"18.2.1","2018-09-04",null,"previous version distributed with data in chiller-specific columns","Adam Groenhuzyen"]
[null,"19.0.0","2018-12-26",null,"Updated ER calcs to use easily found & adjustable program year input","Adam Groenhuzyen"]
[null,null,null,null,"Added new columns for custom EFLH, CF, NCF, hidden by default. Must unlock workbook to unhide, keeping this capability only within engineering. ","Adam Groenhuzyen"]
[null,null,null,null,"Added \"reset workbook\" macro","Adam Groenhuzyen"]
[null,"19.1.0","2019-02-04",null,"Changed minimum efficiencies from \"IECC\" references to \"TRM\" references. Updated minimum efficiencies for AR TRM 8.","Adam Groenhuzyen"]
[null,null,null,null,"Added macro button on Summary to show/hide custom weather info ","Adam Groenhuzyen"]
[null,null,null,null,"Moved things around in Inventory, eliminated one of the cooling efficiency dropdowns and simplified the other to kW/ton or EER options","Adam Groenhuzyen"]
[null,null,null,null,"Added Path B compatibility for AR TRM 8. Updated lookups to default to Path A if a path is not indicated.","Adam Groenhuzyen"]
[null,null,"2019-02-13",null,"Added CRAC for CPS. Updated all RUL's for CPS. Updated Room AC baselines for All. Added \"Data Centers\" building type for CPS.","Adam Groenhuzyen"]
[null,null,null,null,"Moved some of the chiller specific columns around in a way that made more sense.","Adam Groenhuzyen"]
[null,"19.1.1","2019-03-04",null,"Updated ER tables for finalized CPS Guidebook","Adam Groenhuzyen"]
[null,null,"2019-04-04",null,"Added Instructions sheet","Adam Groenhuzyen"]
[null,null,null,null,"Updated CPS Early Retirement Rates","Adam Groenhuzyen"]
[null,null,"2019-05-29",null,"Capped ER savings at minimum of 0","Adam Groenhuzyen"]
[null,19.2,null,null,"Minor changes not documented","Adam Groenhuzyen"]
[null,19.3,"2019-08-16",null,"Added dev unlock","Adam Groenhuzyen"]
[null,null,null,null,"Overhauled geothermal equipment & added for OK, CPS","Adam Groenhuzyen"]
[null,null,"2019-08-22",null,"Updated Inventory formatting, added serial # column for removed equipment, added auto-populating units","Adam Groenhuzyen"]
[null,null,"2019-08-29",null,"Added baseline efficiency override option","Adam Groenhuzyen"]
[null,20,"2019-12-16",null,"General updates for 2020","Adam Groenhuzyen"]
[null,null,"2019-01-21",null,"Updated workbook passwords to new set","Adam Groenhuzyen"]
[null,null,null,null,"Added incentive override feature","Adam Groenhuzyen"]
[null,"20.0.1","2020-10-19",null,"Updated OGE SAGE Incentive","Adam Groenhuzyen"]
[null,21,"2020-11-25",null,"rounded PTAC baselines to 0.1EER","Adam Groenhuzyen"]
[null,null,null,null,"Inventory now shows EFLH/CF for OG&E","Adam Groenhuzyen"]
[null,null,null,null,"Tidied up some of the VBA","Adam Groenhuzyen"]
[null,null,null,null,"Removed LA/MS from back-end tables","Adam Groenhuzyen"]
[null,null,null,null,"Added line item equipment cost","Adam Groenhuzyen"]